{"text_format":"1","workbook":"xlsx","n_sheets":5,"sheets":["LISTE","EMARGEMENT","TAB 10 BRE","SCORE","RELEVE"],"not_rendered":{"charts":0,"images":4,"macros":1,"external_links":0,"defined_names":18,"comments":0,"pivot_tables":0},"unopened":[],"bounds":{"document_bytes":16777216,"sheet_cells":100000,"rows_first":2000,"rows_last":500,"rows_between":2000,"halvings":0,"cell_chars":16384,"cell_head_chars":4096},"cells_cut":0,"cells_raw":0,"read":"whole","date_system":"1900"}

{"sheet":"LISTE","index":0,"n_rows":19,"n_cols":10,"rows_kept":19,"cut":false,"hidden":true,"merged":[]}
[]
[]
[]
[]
[]
[]
[]
[]
[]
[]
[null,null,null,null,"SERIE 1 -2500",null,"MASCULIN",null,2020,"ABS"]
[null,null,null,null,"SERIE 1 -2000",null,"FEMININ",null,2021,1]
[null,null,null,null,"SERIE 1 - 1500",null,"MIXTE",null,2022,2]
[null,null,null,null,"SERIE 2 - 1000",null,null,null,2023,3]
[null,null,null,null,"SERIE 2 - 750",null,null,null,2024,4]
[null,null,null,null,"SERIE 2 - 500",null,null,null,null,5]
[null,null,null,null,"SERIE 2 - 250",null,null,null,null,7]
[null,null,null,null,"SERIE 3 - 150",null,null,null,null,9]
[null,null,null,null,"SERIE 3 "]

{"sheet":"EMARGEMENT","index":1,"n_rows":24,"n_cols":21,"rows_kept":24,"cut":false,"hidden":false,"merged":[[11,17,11,21],[12,17,12,21],[1,4,2,13],[1,14,3,14],[3,4,3,7],[3,8,3,12],[4,4,4,14],[5,4,5,14]]}
[]
[null,null,null,null,{"$f":"IF(U3=\"\",T3,U3)","v":"APPELATION TOURNOI"},null,null,null,null,null,null,null,null,null,{"$f":"IF(U10=\"\",T10,U10)","v":"ORGANISATEUR"},null,null,null,null,null,"IDENTITE DU TOURNOI"]
[null,null,null,null,null,null,null,null,null,null,null,null,null,null,null,null,null,null,null,"APPELATION TOURNOI"]
[null,null,null,null,{"$f":"IF(U4=\"\",T4,U4)","v":"LIEU"},null,null,null,{"$f":"IF(U6=\"\",\"DATE\",CONCATENATE(U7,\"-\",U8,\"/\",U6))","v":"DATE"},null,null,null,null,{"$f":"IF(U9=\"\",T9,U9)","v":"GENRE"},null,null,null,null,null,"LIEU"]
[null,null,null,null,{"$f":"IF(U5=\"\",T5,U5)","v":"TYPE"},null,null,null,null,null,null,null,null,null,null,null,null,null,null,"TYPE"]
[null,null,null,null,"FEUILLE EMARGEMENT",null,null,null,null,null,null,null,null,null,null,null,null,null,null,"ANNEE"]
[null,null,null,null,null,null,null,null,null,null,null,null,null,null,null,null,null,null,null,"DATE DEBUT"]
[null,null,null,null,null,null,null,null,null,null,null,null,null,null,null,null,null,null,null,"DATE FIN"]
[null,"N°",null,"NOM","PRENOM","LICENCE","CLUB","NOM","PRENOM","LICENCE","CLUB","pts","tir","SIGNATURE JOUEUR1","SIGNATURE JOUEUR2","PAIEMENT",null,null,null,"GENRE"]
[null,1,null,null,null,null,null,null,null,null,null,null,null,null,null,null,null,null,null,"ORGANISATEUR"]
[null,2]
[null,3,null,null,null,null,null,null,null,null,null,null,null,null,null,null,null,"1- Commencez par renseigner le tableau ci-dessus \"identité du tournoi\""]
[null,4,null,null,null,null,null,null,null,null,null,null,null,null,null,null,null,"2- Copiez-collez la liste des équipes engagés dans les champs ci-contre en respectant : "]
[null,5,null,null,null,null,null,null,null,null,null,null,null,null,null,null,null,"- nom et premon séparés pour chaque joueur ( à défaut, ne mentionez que le nom)"]
[null,6,null,null,null,null,null,null,null,null,null,null,null,null,null,null,null,"- l'ordre décroissant des têtes de séries"]
[null,7,null,null,null,null,null,null,null,null,null,null,null,null,null,null,null,"3- Saisissez les scores dans l'onglet \"SCORE\", l'onglet \"TAB…\" s'actualise automatiquement."]
[null,8,null,null,null,null,null,null,null,null,null,null,null,null,null,null,null,"4- Renseignez l'onglet \"RELEVE\" à l'issue du tournoi"]
[null,9]
[null,10]
[]
[]
[null,null,null,"Copier/coller selon LISTE ENGAGES en fonction des équipes confirmées"]
[null,null,null,"ATTENTION : Respecter l'ordre des têtes de séries."]
[null,null,null,"Ex: Si Sur LISTE ENGAGES, l'équipe 6 absente, la numéro 7 devient la numéro 6 dans EMARG"]

{"sheet":"TAB 10 BRE","index":2,"n_rows":44,"n_cols":16,"rows_kept":44,"cut":false,"hidden":false,"merged":[[6,4,6,11],[8,4,8,11],[7,4,7,11],[1,4,4,9],[5,4,5,5],[5,6,5,7],[5,8,5,9],[1,10,5,11]]}
[]
[null,null,null,null,{"$f":"EMARGEMENT!E2","v":"APPELATION TOURNOI"},null,null,null,null,null,{"$f":"EMARGEMENT!O2","v":"ORGANISATEUR"}]
[]
[]
[]
[null,null,null,null,{"$f":"EMARGEMENT!E4","v":"LIEU"},null,{"$f":"EMARGEMENT!I4","v":"DATE"},null,{"$f":"EMARGEMENT!N4","v":"GENRE"}]
[null,null,null,null,{"$f":"EMARGEMENT!E5","v":"TYPE"}]
[]
[null,null,null,null,"TABLEAU PRINCIPAL"]
[]
[]
[]
[null,null,"POULES",null,null,"RESULSTATS",null,null,null,null,"CLASS. P",null,"1/2-FINALES",null,"FINALES"]
[]
[]
[null,"TS",null,null,null,{"$f":"IF(C18=\" / \",\"TS1\",C18)","v":"TS1"}]
[null,null,null,null,{"$f":"IF(C24=\" / \",\"TS8\",C24)","v":"TS8"},5]
[null,1,{"$f":"CONCATENATE(EMARGEMENT!D10,\" / \",EMARGEMENT!H10)","v":" / "},null,1,null,{"$f":"SCORE!T12","v":""}]
["POULE A",null,null,null,null,{"$f":"SCORE!T8","v":""},{"$f":"IF(SCORE!K12=SCORE!M12,\"\",CONCATENATE(SCORE!K12,\" / \",SCORE!M12,\" (\",SCORE!N12,\"-\",SCORE!O12,\")(\",SCORE!P12,\"-\",SCORE!Q12,\")(\",SCORE!R12,\"-\",SCORE!S12,\")\"))","v":""}]
[null,4,{"$f":"CONCATENATE(EMARGEMENT!D13,\" / \",EMARGEMENT!H13)","v":" / "},null,{"$f":"IF(C26=\" / \",\"TS9\",C26)","v":"TS9"},{"$f":"IF(SCORE!K8=SCORE!M8,\"\",CONCATENATE(SCORE!K8,\" / \",SCORE!M8,\" (\",SCORE!N8,\"-\",SCORE!O8,\")(\",SCORE!P8,\"-\",SCORE!Q8,\")(\",SCORE!R8,\"-\",SCORE!S8,\")\"))","v":""},9,{"$f":"SCORE!T16","v":""},"1A"]
[null,null,null,null,{"$f":"IF(C20=\" / \",\"TS4\",C20)","v":"TS4"},null,null,{"$f":"IF(SCORE!K16=SCORE!M16,\"\",CONCATENATE(SCORE!K16,\" / \",SCORE!M16,\" (\",SCORE!N16,\"-\",SCORE!O16,\")(\",SCORE!P16,\"-\",SCORE!Q16,\")(\",SCORE!R16,\"-\",SCORE!S16,\")\"))","v":""}]
[null,5,{"$f":"CONCATENATE(EMARGEMENT!D14,\" / \",EMARGEMENT!H14)","v":" / "},null,3]
[null,null,null,null,null,{"$f":"SCORE!T10","v":""},null,null,null,null,"A",null,{"$f":"IF(SCORE!K16=SCORE!M16,\"1A\",SCORE!T16)","v":"1A"}]
[null,8,{"$f":"CONCATENATE(EMARGEMENT!D17,\" / \",EMARGEMENT!H17)","v":" / "},null,{"$f":"IF(C22=\" / \",\"TS5\",C22)","v":"TS5"},{"$f":"IF(SCORE!K10=SCORE!M10,\"\",CONCATENATE(SCORE!K10,\" / \",SCORE!M10,\" (\",SCORE!N10,\"-\",SCORE!O10,\")(\",SCORE!P10,\"-\",SCORE!Q10,\")(\",SCORE!R10,\"-\",SCORE!S10,\")\"))","v":""},null,null,null,1,{"$f":"SCORE!T16","v":""}]
[null,null,null,null,{"$f":"IF(SCORE!K8=SCORE!M8,\"PM1\",SCORE!U8)","v":"PM1"},null,{"$f":"IF(SCORE!K16=SCORE!M16,\"PM9\",SCORE!U16)","v":"PM9"},null,null,2,{"$f":"SCORE!T20","v":""},null,"1/2",null,{"$f":"SCORE!T22","v":""}]
[null,9,{"$f":"CONCATENATE(EMARGEMENT!D18,\" / \",EMARGEMENT!H18)","v":" / "},null,7,{"$f":"SCORE!T14","v":""},13,{"$f":"SCORE!T20","v":""},"2A",3,{"$f":"SCORE!U20","v":""},null,"(15)",null,{"$f":"IF(SCORE!K22=SCORE!M22,\"\",CONCATENATE(SCORE!K22,\" / \",SCORE!M22,\" (\",SCORE!N22,\"-\",SCORE!O22,\")(\",SCORE!P22,\"-\",SCORE!Q22,\")(\",SCORE!R22,\"-\",SCORE!S22,\")\"))","v":""}]
[null,null,null,null,null,{"$f":"IF(SCORE!K14=SCORE!M14,\"\",CONCATENATE(SCORE!K14,\" / \",SCORE!M14,\" (\",SCORE!N14,\"-\",SCORE!O14,\")(\",SCORE!P14,\"-\",SCORE!Q14,\")(\",SCORE!R14,\"-\",SCORE!S14,\")\"))","v":""},null,null,null,4,{"$f":"SCORE!U18","v":""}]
[null,null,null,null,{"$f":"IF(SCORE!K10=SCORE!M10,\"PM2\",SCORE!U10)","v":"PM2"},11,{"$f":"SCORE!T18","v":""},{"$f":"IF(SCORE!K20=SCORE!M20,\"\",CONCATENATE(SCORE!K20,\" / \",SCORE!M20,\" (\",SCORE!N20,\"-\",SCORE!O20,\")(\",SCORE!P20,\"-\",SCORE!Q20,\")(\",SCORE!R20,\"-\",SCORE!S20,\")\"))","v":""},null,5,{"$f":"SCORE!U14","v":""},null,{"$f":"IF(SCORE!K21=SCORE!M21,\"2B\",SCORE!T21)","v":"2B"}]
[null,null,null,null,null,{"$f":"IF(SCORE!K12=SCORE!M12,\"PM5\",SCORE!U12)","v":"PM5"},{"$f":"IF(SCORE!K18=SCORE!M18,\"\",CONCATENATE(SCORE!K18,\" / \",SCORE!M18,\" (\",SCORE!N18,\"-\",SCORE!O18,\")(\",SCORE!P18,\"-\",SCORE!Q18,\")(\",SCORE!R18,\"-\",SCORE!S18,\")\"))","v":""},null,null,null,null,null,null,null,"FINALE",{"$f":"SCORE!T25","v":""}]
[null,null,null,null,null,null,null,null,null,null,"B",null,null,null,"(18)",{"$f":"IF(SCORE!K25=SCORE!M25,\"\",CONCATENATE(SCORE!K25,\" / \",SCORE!M25,\" (\",SCORE!N25,\"-\",SCORE!O25,\")(\",SCORE!P25,\"-\",SCORE!Q25,\")(\",SCORE!R25,\"-\",SCORE!S25,\")\"))","v":""}]
[null,null,null,null,null,{"$f":"IF(C33=\" / \",\"TS2\",C33)","v":"TS2"},null,null,null,1,{"$f":"SCORE!T17","v":""},null,{"$f":"IF(SCORE!K20=SCORE!M20,\"2A\",SCORE!T20)","v":"2A"}]
[null,null,null,null,{"$f":"IF(C39=\" / \",\"TS7\",C39)","v":"TS7"},6,{"$f":"SCORE!T13","v":""},null,null,2,{"$f":"SCORE!T21","v":""}]
[null,2,{"$f":"CONCATENATE(EMARGEMENT!D11,\" / \",EMARGEMENT!H11)","v":" / "},null,2,null,null,null,null,3,{"$f":"SCORE!U21","v":""},null,"1/2"]
["POULE B",null,null,null,null,{"$f":"SCORE!T9","v":""},{"$f":"IF(SCORE!K13=SCORE!M13,\"\",CONCATENATE(SCORE!K13,\" / \",SCORE!M13,\" (\",SCORE!N13,\"-\",SCORE!O13,\")(\",SCORE!P13,\"-\",SCORE!Q13,\")(\",SCORE!R13,\"-\",SCORE!S13,\")\"))","v":""},null,null,4,{"$f":"SCORE!U19","v":""},null,"(16)",null,{"$f":"SCORE!T23","v":""}]
[null,3,{"$f":"CONCATENATE(EMARGEMENT!D12,\" / \",EMARGEMENT!H12)","v":" / "},null,{"$f":"IF(C41=\" / \",\"TS10\",C41)","v":"TS10"},{"$f":"IF(SCORE!K9=SCORE!M9,\"\",CONCATENATE(SCORE!K9,\" / \",SCORE!M9,\" (\",SCORE!N9,\"-\",SCORE!O9,\")(\",SCORE!P9,\"-\",SCORE!Q9,\")(\",SCORE!R9,\"-\",SCORE!S9,\")\"))","v":""},10,{"$f":"SCORE!T17","v":""},"1B",5,{"$f":"SCORE!U15","v":""},null,null,null,{"$f":"IF(SCORE!K23=SCORE!M23,\"\",CONCATENATE(SCORE!K23,\" / \",SCORE!M23,\" (\",SCORE!N23,\"-\",SCORE!O23,\")(\",SCORE!P23,\"-\",SCORE!Q23,\")(\",SCORE!R23,\"-\",SCORE!S23,\")\"))","v":""}]
[null,null,null,null,{"$f":"IF(C35=\" / \",\"TS3\",C35)","v":"TS3"},null,null,{"$f":"IF(SCORE!K17=SCORE!M17,\"\",CONCATENATE(SCORE!K17,\" / \",SCORE!M17,\" (\",SCORE!N17,\"-\",SCORE!O17,\")(\",SCORE!P17,\"-\",SCORE!Q17,\")(\",SCORE!R17,\"-\",SCORE!S17,\")\"))","v":""},null,null,null,null,{"$f":"IF(SCORE!K17=SCORE!M17,\"1B\",SCORE!T17)","v":"1B"}]
[null,6,{"$f":"CONCATENATE(EMARGEMENT!D15,\" / \",EMARGEMENT!H15)","v":" / "},null,4]
[null,null,null,null,null,{"$f":"SCORE!T11","v":""},null,null,null,null,null,null,null,null,{"$f":"SCORE!U22","v":""}]
[null,7,{"$f":"CONCATENATE(EMARGEMENT!D16,\" / \",EMARGEMENT!H16)","v":" / "},null,{"$f":"IF(C37=\" / \",\"TS6\",C37)","v":"TS6"},{"$f":"IF(SCORE!K11=SCORE!M11,\"\",CONCATENATE(SCORE!K11,\" / \",SCORE!M11,\" (\",SCORE!N11,\"-\",SCORE!O11,\")(\",SCORE!P11,\"-\",SCORE!Q11,\")(\",SCORE!R11,\"-\",SCORE!S11,\")\"))","v":""}]
[null,null,null,null,{"$f":"IF(SCORE!K9=SCORE!M9,\"PM2\",SCORE!U9)","v":"PM2"},null,{"$f":"IF(SCORE!K17=SCORE!M17,\"PM10\",SCORE!U17)","v":"PM10"},null,null,null,null,null,null,null,"PLACE 3/4",{"$f":"SCORE!T24","v":""}]
[null,10,{"$f":"CONCATENATE(EMARGEMENT!D19,\" / \",EMARGEMENT!H19)","v":" / "},null,8,{"$f":"SCORE!T15","v":""},14,{"$f":"SCORE!T21","v":""},"2B",null,null,null,null,null,"(17)",{"$f":"IF(SCORE!K24=SCORE!M24,\"\",CONCATENATE(SCORE!K24,\" / \",SCORE!M24,\" (\",SCORE!N24,\"-\",SCORE!O24,\")(\",SCORE!P24,\"-\",SCORE!Q24,\")(\",SCORE!R24,\"-\",SCORE!S24,\")\"))","v":""}]
[null,null,null,null,null,{"$f":"IF(SCORE!K15=SCORE!M15,\"\",CONCATENATE(SCORE!K15,\" / \",SCORE!M15,\" (\",SCORE!N15,\"-\",SCORE!O15,\")(\",SCORE!P15,\"-\",SCORE!Q15,\")(\",SCORE!R15,\"-\",SCORE!S15,\")\"))","v":""}]
[null,null,null,null,{"$f":"IF(SCORE!K11=SCORE!M11,\"PM4\",SCORE!U11)","v":"PM4"},12,{"$f":"SCORE!T19","v":""},{"$f":"IF(SCORE!K21=SCORE!M21,\"\",CONCATENATE(SCORE!K21,\" / \",SCORE!M21,\" (\",SCORE!N21,\"-\",SCORE!O21,\")(\",SCORE!P21,\"-\",SCORE!Q21,\")(\",SCORE!R21,\"-\",SCORE!S21,\")\"))","v":""},null,null,null,null,null,null,{"$f":"SCORE!U23","v":""}]
[null,null,null,null,null,{"$f":"IF(SCORE!K13=SCORE!M13,\"PM6\",SCORE!U13)","v":"PM6"},{"$f":"IF(SCORE!K19=SCORE!M19,\"\",CONCATENATE(SCORE!K19,\" / \",SCORE!M19,\" (\",SCORE!N19,\"-\",SCORE!O19,\")(\",SCORE!P19,\"-\",SCORE!Q19,\")(\",SCORE!R19,\"-\",SCORE!S19,\")\"))","v":""}]

{"sheet":"SCORE","index":3,"n_rows":25,"n_cols":34,"rows_kept":25,"cut":false,"hidden":false,"merged":[]}
[null,null,null,"TABLEAU DE SAISIE DE RESULTATS"]
[]
["DEBUT J1","00:00:00",null,"Saisir le résultats des setas dans les cases bordurées et colorées uniquement"]
["TEMPS","00:00:00"]
["DEBUT J2","00:00:00"]
[]
[null,null,"PHASE","JOUR","N° MATCH","HEURE","TER","EQ1",null,"EQ2","SCORE EQ1",null,"SCORE EQ2","SET 1 EQ1","SET 1 EQ2","SET 2 EQ1","SET 2 EQ2","SET 3 EQ1","SET 3 EQ2","POS 1","POS 2",null,null,null,null,"PTS","S+","S-","P+","P-","CS","CP","CLA","RG"]
["POULE A","POULE B","A",1,1,{"$f":"B3","v":"00:00:00"},1,{"$f":"'TAB 10 BRE'!E17","v":"TS8"},"/",{"$f":"'TAB 10 BRE'!E20","v":"TS9"},{"$f":"SUM(IF(N8>O8,1,0),IF(P8>Q8,1,0),IF(R8>S8,1,0))","v":0},"/",{"$f":"SUM(IF(O8>N8,1,0),IF(Q8>P8,1,0),IF(S8>R8,1,0))","v":0},null,null,null,null,null,null,{"$f":"IF(K8=M8,\"\",IF(K8>M8,H8,J8))","v":""},{"$f":"IF(K8=M8,\"\",IF(K8<M8,H8,J8))","v":""},null,null,"A",{"$f":"'TAB 10 BRE'!C18","v":" / "},{"$f":"COUNTIF(PLACE1,Y8)*2+COUNTIF($U$8:$U$25,Y8)","v":0},{"$f":"SUMIF(LISTEE1,Y8,(SCEQ1))+SUMIF(LISTEE2,Y8,(SCEQ2))","v":0},{"$f":"SUMIF(LISTEE1,Y8,(SCEQ2))+SUMIF(LISTEE2,Y8,(SCEQ1))","v":0},{"$f":"(SUMPRODUCT((LISTEE1=Y8)*((S1EQ1)+(S2EQ1)+(S3EQ1))))+(SUMPRODUCT((LISTEE2=Y8)*((S1EQ2)+(S2EQ2)+(S3EQ3))))","v":0},{"$f":"(SUMPRODUCT((LISTEE2=Y8)*((S1EQ1)+(S2EQ1)+(S3EQ1))))+(SUMPRODUCT((LISTEE1=Y8)*((S1EQ2)+(S2EQ2)+(S3EQ3))))","v":0},{"$f":"IFERROR(AA8/AB8,0)","v":0},{"$f":"IFERROR(AC8/AD8,0)","v":0},{"$f":"Z8+AE8/100+AF8/100","v":0},{"$f":"RANK(AG8,AG8:AG12)","v":1}]
["A","B","B",1,2,{"$f":"B3+$B$4","v":"00:00:00"},2,{"$f":"'TAB 10 BRE'!E32","v":"TS7"},"/",{"$f":"'TAB 10 BRE'!E35","v":"TS10"},{"$f":"SUM(IF(N9>O9,1,0),IF(P9>Q9,1,0),IF(R9>S9,1,0))","v":0},"/",{"$f":"SUM(IF(O9>N9,1,0),IF(Q9>P9,1,0),IF(S9>R9,1,0))","v":0},null,null,null,null,null,null,"","",null,null,null,{"$f":"'TAB 10 BRE'!C20","v":" / "},0,{"$f":"SUMIF(LISTEE1,Y9,(SCEQ1))+SUMIF(LISTEE2,Y9,(SCEQ2))","v":0},{"$f":"SUMIF(LISTEE1,Y9,(SCEQ2))+SUMIF(LISTEE2,Y9,(SCEQ1))","v":0},0,0,{"$f":"IFERROR(AA9/AB9,0)","v":0},{"$f":"IFERROR(AC9/AD9,0)","v":0},{"$f":"Z9+AE9/100+AF9/100","v":0},{"$f":"RANK(AG9,AG8:AG12)","v":1}]
["D","C","A",1,3,{"$f":"F8+$B$4","v":"00:00:00"},1,{"$f":"'TAB 10 BRE'!E21","v":"TS4"},"/",{"$f":"'TAB 10 BRE'!E24","v":"TS5"},0,"/",0,null,null,null,null,null,null,"","",null,null,null,{"$f":"'TAB 10 BRE'!C22","v":" / "},0,0,{"$f":"SUMIF(LISTEE1,Y10,SCEQ2)+SUMIF(LISTEE2,Y10,SCEQ1)","v":0},0,0,0,0,0,{"$f":"RANK(AG10,AG8:AG12)","v":1}]
["E","F","B",1,4,"00:00:00",2,{"$f":"'TAB 10 BRE'!E36","v":"TS3"},"/",{"$f":"'TAB 10 BRE'!E39","v":"TS6"},0,"/",0,null,null,null,null,null,null,"","",null,null,null,{"$f":"'TAB 10 BRE'!C24","v":" / "},0,0,0,0,0,0,0,0,{"$f":"RANK(AG11,AG8:AG12)","v":1}]
["H","G","A",1,5,"00:00:00",1,{"$f":"'TAB 10 BRE'!F16","v":"TS1"},"/",{"$f":"T8","v":""},0,"/",0,null,null,null,null,null,null,"","",null,null,null,{"$f":"'TAB 10 BRE'!C26","v":" / "},0,0,0,0,0,0,0,0,{"$f":"RANK(AG12,AG8:AG12)","v":1}]
["I","J","B",1,6,"00:00:00",2,{"$f":"'TAB 10 BRE'!F31","v":"TS2"},"/",{"$f":"T9","v":""},0,"/",0,null,null,null,null,null,null,"","",null,null,"B",{"$f":"'TAB 10 BRE'!C33","v":" / "},0,0,0,0,0,0,0,0,{"$f":"RANK(AG13,$AG13:$AG17)","v":1}]
[null,null,"A",1,7,"00:00:00",1,{"$f":"U8","v":""},"/",{"$f":"U10","v":""},{"$f":"SUM(IF(N14>O14,1,0),IF(P14>Q14,1,0),IF(R14>S14,1,0))","v":0},"/",0,null,null,null,null,null,null,"","",null,null,null,{"$f":"'TAB 10 BRE'!C35","v":" / "},0,0,0,0,0,0,0,0,{"$f":"RANK(AG14,$AG13:$AG17)","v":1}]
[null,null,"B",1,8,"00:00:00",2,{"$f":"U9","v":""},"/",{"$f":"U11","v":""},0,"/",0,null,null,null,null,null,null,"","",null,null,null,{"$f":"'TAB 10 BRE'!C37","v":" / "},0,0,0,0,0,0,0,0,{"$f":"RANK(AG15,$AG13:$AG17)","v":1}]
[null,null,"A",1,9,"00:00:00",1,{"$f":"T12","v":""},"/",{"$f":"T10","v":""},0,"/",0,null,null,null,null,null,null,"","",null,null,null,{"$f":"'TAB 10 BRE'!C39","v":" / "},0,0,0,0,0,0,0,0,{"$f":"RANK(AG16,$AG13:$AG17)","v":1}]
[null,null,"B",1,10,"00:00:00",2,{"$f":"T13","v":""},"/",{"$f":"T11","v":""},0,"/",0,null,null,null,null,null,null,"","",null,null,null,{"$f":"'TAB 10 BRE'!C41","v":" / "},0,0,0,0,0,0,0,0,{"$f":"RANK(AG17,$AG13:$AG17)","v":1}]
[null,null,"A",1,11,"00:00:00",1,{"$f":"T14","v":""},"/",{"$f":"U12","v":""},0,"/",0,null,null,null,null,null,null,"",""]
[null,null,"B",1,12,"00:00:00",1,{"$f":"T15","v":""},"/",{"$f":"U13","v":""},0,"/",0,null,null,null,null,null,null,"",""]
[null,null,"A",1,13,"00:00:00",1,{"$f":"U16","v":""},"/",{"$f":"T18","v":""},0,"/",0,null,null,null,null,null,null,"",""]
[null,null,"B",1,14,"00:00:00",1,{"$f":"U17","v":""},"/",{"$f":"T19","v":""},0,"/",0,null,null,null,null,null,null,"",""]
[null,null,"1/2",2,15,{"$f":"B5","v":"00:00:00"},1,{"$f":"T16","v":""},"/",{"$f":"T21","v":""},0,"/",0,null,null,null,null,null,null,"",""]
[null,null,"1/2",2,16,{"$f":"F22+$B$4","v":"00:00:00"},1,{"$f":"T17","v":""},"/",{"$f":"T20","v":""},0,"/",0,null,null,null,null,null,null,"",""]
[null,null,"PF",2,17,"14:00:00",1,{"$f":"U22","v":""},"/",{"$f":"U23","v":""},0,"/",0,null,null,null,null,null,null,"",""]
[null,null,"F",2,18,"14:00:00",1,{"$f":"T22","v":""},"/",{"$f":"T23","v":""},0,"/",0,null,null,null,null,null,null,"",""]

{"sheet":"RELEVE","index":4,"n_rows":76,"n_cols":13,"rows_kept":76,"cut":false,"hidden":false,"merged":[[9,7,9,8],[2,1,2,2],[2,3,2,9],[3,1,3,2],[3,3,3,4],[4,1,4,2],[4,3,4,4],[5,1,5,2],[5,3,5,4],[6,1,6,2],[6,3,6,4],[8,7,8,8],[75,1,81,9],[14,3,14,5],[15,1,15,2],[15,3,15,5],[16,1,16,2],[16,3,16,5],[17,1,17,2],[17,3,17,5],[18,1,18,2],[18,3,18,5],[19,1,19,2],[19,3,19,5],[66,1,72,9]]}
[null,"RELEVE DES RESULTATS ET SANCTIONS - TOURNOI DE BEACH VOLLEY"]
[]
[null,"APPELATION DU TOURNOI",null,{"$f":"IF(EMARGEMENT!U3=\"\",\"\",EMARGEMENT!U3)","v":""}]
[null,"TYPE",null,{"$f":"IF(EMARGEMENT!U5=\"\",\"\",EMARGEMENT!U5)","v":""}]
[null,"GENRE",null,{"$f":"IF(EMARGEMENT!U9=\"\",\"\",EMARGEMENT!U9)","v":""}]
[null,"DATE",null,{"$f":"IF(EMARGEMENT!U6=\"\",\"\",CONCATENATE(EMARGEMENT!U7,\"-\",EMARGEMENT!U8,\"/\",EMARGEMENT!Y7))","v":""}]
[null,"ORGANISATEUR",null,{"$f":"IF(EMARGEMENT!U10=\"\",\"\",EMARGEMENT!U10)","v":""}]
[]
[null,"NOMBRE EQUIPE TABLEAU :",null,null,"PRINCIPAL",null,null,"QUALIFICATION"]
[null,"NOMBRE EQUIPE PRESENTES PAR TABLEAU",null,null,"PRINCIPAL",null,null,"QUALIFICATION"]
[]
[]
[null,"COMPOSITION DE LA COMMISSION DE DIRECTION"]
[]
[null,"DELEGUE INSTANCE FEDERAL"]
[null,"SUPERVISEUR"]
[null,"JUGE ARBITRE"]
[null,"ORGANISATEUR"]
[null,"REPRESENTANT JOUEURS"]
[null,"RAPPORTEUR*"]
[]
[]
[]
[]
[]
[null,"EQUIPES ABSENTES"]
[null,"NOM","PRENOM","LIC J1","club J1","NOM2","PRENOM3","LIC J2","club J2"]
[]
[]
[]
[]
[]
[]
[null,"RECLAMATIONS"]
[null,"NOM","PRENOM","LIC J1","club J1","NOM2","PRENOM3","LIC J2","club J2","RANG","NIVEAU","MOTIF ","AVIS COMMISSION"]
[1]
[2]
[3]
[4]
[5]
[6]
[]
[null,"EQUIPES/JOUEURS SANCTIONNES"]
[null,"NOM","PRENOM","LIC J1","club J1","NOM2","PRENOM3","LIC J2","club J2","RANG","SANCTION","MOTIF ","AVIS COMMISSION"]
[1]
[2]
[3]
[4]
[5]
[6]
[]
[null,"CLASSEMENT FINAL"]
[null,"NOM","PRENOM","LIC J1","club J1","NOM2","PRENOM3","LIC J2","club J2","RANG"]
[null,{"$f":"EMARGEMENT!D10","v":0},{"$f":"EMARGEMENT!E10","v":0},{"$f":"EMARGEMENT!F10","v":0},{"$f":"EMARGEMENT!G10","v":0},{"$f":"EMARGEMENT!H10","v":0},{"$f":"EMARGEMENT!I10","v":0},{"$f":"EMARGEMENT!J10","v":0},{"$f":"EMARGEMENT!K10","v":0},1]
[null,{"$f":"EMARGEMENT!D11","v":0},{"$f":"EMARGEMENT!E11","v":0},{"$f":"EMARGEMENT!F11","v":0},{"$f":"EMARGEMENT!G11","v":0},{"$f":"EMARGEMENT!H11","v":0},{"$f":"EMARGEMENT!I11","v":0},{"$f":"EMARGEMENT!J11","v":0},{"$f":"EMARGEMENT!K11","v":0},2]
[null,{"$f":"EMARGEMENT!D16","v":0},{"$f":"EMARGEMENT!E16","v":0},{"$f":"EMARGEMENT!F16","v":0},{"$f":"EMARGEMENT!G16","v":0},{"$f":"EMARGEMENT!H16","v":0},{"$f":"EMARGEMENT!I16","v":0},{"$f":"EMARGEMENT!J16","v":0},{"$f":"EMARGEMENT!K16","v":0},3]
[null,{"$f":"EMARGEMENT!D18","v":0},{"$f":"EMARGEMENT!E18","v":0},{"$f":"EMARGEMENT!F18","v":0},{"$f":"EMARGEMENT!G18","v":0},{"$f":"EMARGEMENT!H18","v":0},{"$f":"EMARGEMENT!I18","v":0},{"$f":"EMARGEMENT!J18","v":0},{"$f":"EMARGEMENT!K18","v":0},4]
[null,{"$f":"EMARGEMENT!D12","v":0},{"$f":"EMARGEMENT!E12","v":0},{"$f":"EMARGEMENT!F12","v":0},{"$f":"EMARGEMENT!G12","v":0},{"$f":"EMARGEMENT!H12","v":0},{"$f":"EMARGEMENT!I12","v":0},{"$f":"EMARGEMENT!J12","v":0},{"$f":"EMARGEMENT!K12","v":0},5]
[null,{"$f":"EMARGEMENT!D13","v":0},{"$f":"EMARGEMENT!E13","v":0},{"$f":"EMARGEMENT!F13","v":0},{"$f":"EMARGEMENT!G13","v":0},{"$f":"EMARGEMENT!H13","v":0},{"$f":"EMARGEMENT!I13","v":0},{"$f":"EMARGEMENT!J13","v":0},{"$f":"EMARGEMENT!K13","v":0},5]
[null,{"$f":"EMARGEMENT!D14","v":0},{"$f":"EMARGEMENT!E14","v":0},{"$f":"EMARGEMENT!F14","v":0},{"$f":"EMARGEMENT!G14","v":0},{"$f":"EMARGEMENT!H14","v":0},{"$f":"EMARGEMENT!I14","v":0},{"$f":"EMARGEMENT!J14","v":0},{"$f":"EMARGEMENT!K14","v":0},7]
[null,{"$f":"EMARGEMENT!D15","v":0},{"$f":"EMARGEMENT!E15","v":0},{"$f":"EMARGEMENT!F15","v":0},{"$f":"EMARGEMENT!G15","v":0},{"$f":"EMARGEMENT!H15","v":0},{"$f":"EMARGEMENT!I15","v":0},{"$f":"EMARGEMENT!J15","v":0},{"$f":"EMARGEMENT!K15","v":0},7]
[null,{"$f":"EMARGEMENT!D17","v":0},{"$f":"EMARGEMENT!E17","v":0},{"$f":"EMARGEMENT!F17","v":0},{"$f":"EMARGEMENT!G17","v":0},{"$f":"EMARGEMENT!H17","v":0},{"$f":"EMARGEMENT!I17","v":0},{"$f":"EMARGEMENT!J17","v":0},{"$f":"EMARGEMENT!K17","v":0},9]
[null,{"$f":"EMARGEMENT!D19","v":0},{"$f":"EMARGEMENT!E19","v":0},{"$f":"EMARGEMENT!F19","v":0},{"$f":"EMARGEMENT!G19","v":0},{"$f":"EMARGEMENT!H19","v":0},{"$f":"EMARGEMENT!I19","v":0},{"$f":"EMARGEMENT!J19","v":0},{"$f":"EMARGEMENT!K19","v":0},9]
[]
[]
[]
[null,"REMARQUES :"]
[]
[]
[]
[]
[]
[]
[]
[]
[null,"SIGNATURES :"]