{"text_format":"1","workbook":"xlsx","n_sheets":11,"sheets":["LISTES","LISTE ENGAGES","EMARG Tableau Qualif","PLANNING PS 16 Quali","SCORE QUAL","TAB 16 PS Qualif","EMARG M Tableau PRIN","PLANNING PS 16","SCORE PRIN","TAB 16 PS PRINC","RELEVE"],"not_rendered":{"charts":0,"images":8,"macros":1,"external_links":0,"defined_names":42,"comments":0,"pivot_tables":0},"unopened":[],"bounds":{"document_bytes":16777216,"sheet_cells":100000,"rows_first":2000,"rows_last":500,"rows_between":2000,"halvings":0,"cell_chars":16384,"cell_head_chars":4096},"cells_cut":0,"cells_raw":0,"read":"whole","date_system":"1900"}

{"sheet":"LISTES","index":0,"n_rows":66,"n_cols":19,"rows_kept":66,"cut":false,"hidden":true,"merged":[]}
[]
[]
[]
[]
[]
[]
[null,null,"CHAMPIONNAT DE France",null,2020,null,"MASCULIN","ABS",1,6.9444000000000005E-4,null,null,null,null,12,0.5,null,null,"12h"]
[null,null,"SERIE 1 - 2500",null,2021,null,"FEMININ",1,2,{"$f":"J7*I8","v":1.3888800000000001E-3},null,null,null,null,{"$f":"O7/2","v":6},{"$f":"P7/2","v":0.25},null,null,"6h"]
[null,null,"SERIE 1 - 2000",null,2022,null,"MIXTE",2,3,6.9444000000000005E-4,null,null,null,null,{"$f":"O8/2","v":3},0.125,null,null,"3h"]
[null,null,"SERIE 1 - 1500",null,2023,null,null,3,4,{"$f":"J9*I10","v":2.7777600000000002E-3},null,null,null,null,1,{"$f":"P9/3","v":4.1666666666666664E-2},null,null,"1h"]
[null,null,"SERIE 2 - 1000",null,2024,null,null,4,5,6.9444000000000005E-4,null,null,null,null,0.5,{"$f":"P10/2","v":2.0833333333333332E-2},null,null,"30mn"]
[null,null,"SERIE 2 - 750",null,null,null,null,5,6,{"$f":"J11*I12","v":4.1666400000000001E-3},null,null,null,null,{"$f":"O9/2","v":1.5},{"$f":"P9/2","v":6.25E-2},null,null,"1,30 h"]
[null,null,"SERIE 2 - 500",null,null,null,null,6,7,6.9444000000000005E-4,null,null,null,null,{"$f":"O12/2","v":0.75},3.125E-2,null,null,"45mn"]
[null,null,"SERIE 2 - 250",null,null,null,null,7,8,{"$f":"J13*I14","v":5.5555200000000004E-3},null,null,null,null,{"$f":"O13/2","v":0.375},1.5625E-2,null,null,"22mn"]
[null,null,"SERIE 3 - 150",null,null,null,null,8,9,6.9444000000000005E-4,null,null,null,null,null,{"$f":"P10/60","v":6.9444444444444436E-4},null,null,"1mn"]
[null,null,"SERIE 3 - 100",null,null,null,null,9,10,{"$f":"J15*I16","v":6.9444000000000007E-3},null,null,null,null,null,{"$f":"P15*50","v":3.4722222222222217E-2},null,null,"50mn"]
[null,null,null,null,null,null,null,10,11,6.9444000000000005E-4]
[null,null,null,null,null,null,null,11,12,{"$f":"J17*I18","v":8.3332800000000002E-3}]
[null,null,null,null,null,null,null,12,13,6.9444000000000005E-4]
[null,null,null,null,null,null,null,13,14,{"$f":"J19*I20","v":9.7221600000000005E-3}]
[null,null,null,null,null,null,null,14,15,6.9444000000000005E-4]
[null,null,null,null,null,null,null,15,16,{"$f":"J21*I22","v":1.1111040000000001E-2}]
[null,null,null,null,null,null,null,16,17,6.9444000000000005E-4]
[null,null,null,null,null,null,null,17,18,{"$f":"J23*I24","v":1.2499920000000001E-2}]
[null,null,null,null,null,null,null,18,19,6.9444000000000005E-4]
[null,null,null,null,null,null,null,19,20,{"$f":"J25*I26","v":1.3888800000000001E-2}]
[null,null,null,null,null,null,null,20,21,6.9444000000000005E-4]
[null,null,null,null,null,null,null,21,22,{"$f":"J27*I28","v":1.5277680000000002E-2}]
[null,null,null,null,null,null,null,22,23,6.9444000000000005E-4]
[null,null,null,null,null,null,null,23,24,{"$f":"J29*I30","v":1.666656E-2}]
[null,null,null,null,null,null,null,24,25,6.9444000000000005E-4]
[null,null,null,null,null,null,null,25,26,{"$f":"J31*I32","v":1.8055440000000002E-2}]
[null,null,null,null,null,null,null,26,27,6.9444000000000005E-4]
[null,null,null,null,null,null,null,27,28,{"$f":"J33*I34","v":1.9444320000000001E-2}]
[null,null,null,null,null,null,null,28,29,6.9444000000000005E-4]
[null,null,null,null,null,null,null,29,30,{"$f":"J35*I36","v":2.0833200000000003E-2}]
[null,null,null,null,null,null,null,30,31,6.9444000000000005E-4]
[null,null,null,null,null,null,null,31,32,{"$f":"J37*I38","v":2.2222080000000002E-2}]
[null,null,null,null,null,null,null,32,33,6.9444000000000005E-4]
[null,null,null,null,null,null,null,null,34,{"$f":"J39*I40","v":2.361096E-2}]
[null,null,null,null,null,null,null,null,35,6.9444000000000005E-4]
[null,null,null,null,null,null,null,null,36,{"$f":"J41*I42","v":2.4999840000000002E-2}]
[null,null,null,null,null,null,null,null,37,6.9444000000000005E-4]
[null,null,null,null,null,null,null,null,38,{"$f":"J43*I44","v":2.6388720000000001E-2}]
[null,null,null,null,null,null,null,null,39,6.9444000000000005E-4]
[null,null,null,null,null,null,null,null,40,{"$f":"J45*I46","v":2.7777600000000003E-2}]
[null,null,null,null,null,null,null,null,41,6.9444000000000005E-4]
[null,null,null,null,null,null,null,null,42,{"$f":"J47*I48","v":2.9166480000000002E-2}]
[null,null,null,null,null,null,null,null,43,6.9444000000000005E-4]
[null,null,null,null,null,null,null,null,44,{"$f":"J49*I50","v":3.0555360000000004E-2}]
[null,null,null,null,null,null,null,null,45,6.9444000000000005E-4]
[null,null,null,null,null,null,null,null,46,{"$f":"J51*I52","v":3.1944240000000006E-2}]
[null,null,null,null,null,null,null,null,47,6.9444000000000005E-4]
[null,null,null,null,null,null,null,null,48,{"$f":"J53*I54","v":3.3333120000000001E-2}]
[null,null,null,null,null,null,null,null,49,6.9444000000000005E-4]
[null,null,null,null,null,null,null,null,50,{"$f":"J55*I56","v":3.4722000000000003E-2}]
[null,null,null,null,null,null,null,null,51,6.9444000000000005E-4]
[null,null,null,null,null,null,null,null,52,{"$f":"J57*I58","v":3.6110880000000005E-2}]
[null,null,null,null,null,null,null,null,53,6.9444000000000005E-4]
[null,null,null,null,null,null,null,null,54,{"$f":"J59*I60","v":3.749976E-2}]
[null,null,null,null,null,null,null,null,55,6.9444000000000005E-4]
[null,null,null,null,null,null,null,null,56,{"$f":"J61*I62","v":3.8888640000000002E-2}]
[null,null,null,null,null,null,null,null,57,6.9444000000000005E-4]
[null,null,null,null,null,null,null,null,58,{"$f":"J63*I64","v":4.0277520000000004E-2}]
[null,null,null,null,null,null,null,null,59,6.9444000000000005E-4]
[null,null,null,null,null,null,null,null,60,{"$f":"J65*I66","v":4.1666400000000006E-2}]

{"sheet":"LISTE ENGAGES","index":1,"n_rows":34,"n_cols":18,"rows_kept":34,"cut":false,"hidden":false,"merged":[[12,14,12,18],[11,14,11,18],[0,2,2,6],[0,7,2,7],[3,2,3,3],[5,2,5,7],[4,2,4,7]]}
[null,null,{"$f":"IF(R3<>\"\",R3,Q3)","v":"APPELATION TOURNOI"},null,null,null,null,{"$f":"IF(R10=\"\",Q10,R10)","v":"ORGANISATEUR"}]
[null,null,null,null,null,null,null,null,null,null,null,null,null,null,null,null,null,"IDENTITE DU TOURNOI"]
[null,null,null,null,null,null,null,null,null,null,null,null,null,null,null,null,"APPELATION TOURNOI"]
[null,null,{"$f":"IF(R4<>\"\",R4,Q4)","v":"LIEU"},null,null,null,{"$f":"IF(R6=\"\",\"DATE\",CONCATENATE(R7,\"-\",R8,\"/\",R6))","v":"DATE"},{"$f":"IF(R9=\"\",Q9,R9)","v":"GENRE"},null,null,null,null,null,null,null,null,"LIEU"]
[null,null,{"$f":"IF(R5<>\"\",R5,Q5)","v":"TYPE"},null,null,null,null,null,null,null,null,null,null,null,null,null,"TYPE"]
[null,null,"LISTE EQUIPES ENGAGEES",null,null,null,null,null,null,null,null,null,null,null,null,null,"ANNEE"]
[null,null,null,null,null,null,null,null,null,null,null,null,null,null,null,null,"DATE DEBUT"]
["N°",null,"NOM","PRENOM","LICENCE","CLUB","NOM","PRENOM","LICENCE","CLUB","pts","tir",null,null,null,null,"DATE FIN"]
[1,null,null,null,null,null,null,null,null,null,null,null,null,null,null,null,"GENRE"]
[2,null,null,null,null,null,null,null,null,null,null,null,null,null,null,null,"ORGANISATEUR"]
[3]
[4,null,null,null,null,null,null,null,null,null,null,null,null,null,"1- Commencez par renseigner le tableau ci-dessus \"identité du tournoi\""]
[5,null,null,null,null,null,null,null,null,null,null,null,null,null,"2- Copiez-collez la liste des équipes engagées dans les champs ci-contre en respectant : "]
[6,null,null,null,null,null,null,null,null,null,null,null,null,null,"- nom et premon séparés pour chaque joueur ( à défaut, ne mentionez que le nom)"]
[7,null,null,null,null,null,null,null,null,null,null,null,null,null,"- l'ordre décroissant des têtes de séries"]
[8,null,null,null,null,null,null,null,null,null,null,null,null,null,"3- Renseignez l'onglet \"EMARG….\" selon l'avancée dans les tableaux"]
[9,null,null,null,null,null,null,null,null,null,null,null,null,null,"4-Renseignez les scores des rencontres dans l'onglet \" SCORE…\" en fonction de l'avancée du tableau"]
[10,null,null,null,null,null,null,null,null,null,null,null,null,null,"Les onglets \"TAB…\" s'actualisent automatiquement, il n'y a rien à saisir."]
[11,null,null,null,null,null,null,null,null,null,null,null,null,null,"5- Renseignez l'onglet \"RELEVE\" à l'issue de la compétition"]
[12]
[13]
[14]
[15]
[16]
[17]
[18]
[19]
[20]
[21]
[22]
[23]
[24]
[25]
[26]

{"sheet":"EMARG Tableau Qualif","index":2,"n_rows":28,"n_cols":14,"rows_kept":28,"cut":false,"hidden":false,"merged":[[5,3,5,13],[1,3,2,12],[1,13,3,13],[3,3,3,6],[3,7,3,11],[4,3,4,13]]}
[]
[null,null,null,{"$f":"IF('LISTE ENGAGES'!R3=\"\",'LISTE ENGAGES'!Q3,'LISTE ENGAGES'!R3)","v":"APPELATION TOURNOI"},null,null,null,null,null,null,null,null,null,{"$f":"IF('LISTE ENGAGES'!R10=\"\",'LISTE ENGAGES'!Q10,'LISTE ENGAGES'!R10)","v":"ORGANISATEUR"}]
[]
[null,null,null,{"$f":"IF('LISTE ENGAGES'!R4=\"\",'LISTE ENGAGES'!Q4,'LISTE ENGAGES'!R4)","v":"LIEU"},null,null,null,{"$f":"IF('LISTE ENGAGES'!R8=\"\",'LISTE ENGAGES'!Q8,'LISTE ENGAGES'!R8)","v":"DATE FIN"},null,null,null,null,{"$f":"IF('LISTE ENGAGES'!R9=\"\",'LISTE ENGAGES'!Q9,'LISTE ENGAGES'!R9)","v":"GENRE"}]
[null,null,null,{"$f":"IF('LISTE ENGAGES'!R5=\"\",'LISTE ENGAGES'!Q5,'LISTE ENGAGES'!R5)","v":"TYPE"}]
[null,null,null,"FEUILLE EMARGEMENT"]
[]
["N°",null,"NOM","PRENOM","LIC","CLUB","NOM","PRENOM","LIC","CLUB","pts","tir","SIGNATURE JOUEUR1","SIGNATURE JOUEUR2"]
[1,null,"T",null,null,null,1]
[2,null,"T",null,null,null,2]
[3,null,"T",null,null,null,3]
[4,null,"T",null,null,null,4]
[5,null,"T",null,null,null,5]
[6,null,"T",null,null,null,6]
[7,null,"T",null,null,null,7]
[8,null,"T",null,null,null,8]
[9,null,"T",null,null,null,9]
[10,null,"T",null,null,null,10]
[11,null,"T",null,null,null,11]
[12,null,"T",null,null,null,12]
[13,null,"T",null,null,null,13]
[14,null,"T",null,null,null,14]
[15,null,"T",null,null,null,15]
[16,null,"T",null,null,null,16]
[]
[null,null,"Copier/coller selon LISTE ENGAGES en fonction des équipes confirmées"]
[null,null,"ATTENTION : Respecter l'ordre des têtes de séries."]
[null,null,"Ex: Si Sur LISTE ENGAGES, l'équipe 9 absente, la numéro 10 devient la numéro 9 dans EMARG"]

{"sheet":"PLANNING PS 16 Quali","index":3,"n_rows":27,"n_cols":19,"rows_kept":27,"cut":false,"hidden":false,"merged":[[1,7,4,15],[1,16,7,17],[3,2,3,3],[5,7,5,9],[5,10,5,13],[5,14,5,15],[6,7,6,15],[7,7,7,15]]}
[]
[null,null,null,null,null,null,null,{"$f":"IF('LISTE ENGAGES'!R3=\"\",'LISTE ENGAGES'!Q3,'LISTE ENGAGES'!R3)","v":"APPELATION TOURNOI"},null,null,null,null,null,null,null,null,{"$f":"IF('LISTE ENGAGES'!$R$10<>\"\",'LISTE ENGAGES'!$R$10,'LISTE ENGAGES'!$Q$10)","v":"ORGANISATEUR"}]
[]
[null,"J1","HEURE DEBUT",null,"09:00:00"]
[null,null,"DUREE MATCH",null,"00:50:00"]
[null,null,null,null,null,null,null,{"$f":"IF('LISTE ENGAGES'!R4=\"\",'LISTE ENGAGES'!Q4,'LISTE ENGAGES'!R4)","v":"LIEU"},null,null,{"$f":"IF('LISTE ENGAGES'!R8=\"\",'LISTE ENGAGES'!Q8,'LISTE ENGAGES'!R8)","v":"DATE FIN"},null,null,null,{"$f":"IF('LISTE ENGAGES'!R9=\"\",'LISTE ENGAGES'!Q9,'LISTE ENGAGES'!R9)","v":"GENRE"}]
[null,null,null,null,null,null,null,{"$f":"IF('LISTE ENGAGES'!R5=\"\",'LISTE ENGAGES'!Q5,'LISTE ENGAGES'!R5)","v":"TYPE"}]
[null,null,null,null,null,null,null,"PLANNING DES RENCONTRES TABLEAU DE QUALIFICATION"]
[]
[]
[]
[]
[null,null,null,null,"MATCH","n°","TER.","E1","./.","E2","ARB","MATCH","n°","TER.","E1","./.","E2","ARB","POINTS"]
[null,null,"JOUR 1",{"$f":"E4","v":"09:00:00"},"AM1",1,null,{"$f":"'TAB 16 PS Qualif'!C13","v":"T / 1"},null,{"$f":"'TAB 16 PS Qualif'!C16","v":"T / 16"},null,"AM2",5,null,{"$f":"'TAB 16 PS Qualif'!C14","v":"T / 8"},null,{"$f":"'TAB 16 PS Qualif'!C15","v":"T / 9"},null,"2*21, SD 15"]
[null,null,null,{"$f":"D14+$E$5","v":"09:50:00"},"BM1",3,null,{"$f":"'TAB 16 PS Qualif'!C20","v":"T / 2"},null,{"$f":"'TAB 16 PS Qualif'!C23","v":"T / 15"},null,"BM2",7,null,{"$f":"'TAB 16 PS Qualif'!C21","v":"T / 7"},null,{"$f":"'TAB 16 PS Qualif'!C22","v":"T / 10"},null,"2*21, SD 15"]
[null,null,null,{"$f":"D15+$E$5","v":"10:40:00"},"CM1",2,null,{"$f":"'TAB 16 PS Qualif'!C27","v":"T / 3"},null,{"$f":"'TAB 16 PS Qualif'!C30","v":"T / 14"},null,"CM2",6,null,{"$f":"'TAB 16 PS Qualif'!C28","v":"T / 6"},null,{"$f":"'TAB 16 PS Qualif'!C29","v":"T / 11"},null,"2*21, SD 15"]
[null,null,null,"11:30:00","DM1",4,null,{"$f":"'TAB 16 PS Qualif'!C34","v":"T / 4"},null,{"$f":"'TAB 16 PS Qualif'!C37","v":"T / 13"},null,"DM2",8,null,{"$f":"'TAB 16 PS Qualif'!C35","v":"T / 5"},null,{"$f":"'TAB 16 PS Qualif'!C36","v":"T / 12"},null,"2*21, SD 15"]
[null,null,null,"12:20:00","AM3",9,null,{"$f":"'TAB 16 PS Qualif'!C14","v":"T / 8"},null,{"$f":"'TAB 16 PS Qualif'!C16","v":"T / 16"},null,"AM4",13,null,{"$f":"'TAB 16 PS Qualif'!C13","v":"T / 1"},null,{"$f":"'TAB 16 PS Qualif'!C15","v":"T / 9"},null,"2*21, SD 15"]
[null,null,null,"13:10:00","BM3",11,null,{"$f":"'TAB 16 PS Qualif'!C21","v":"T / 7"},null,{"$f":"'TAB 16 PS Qualif'!C23","v":"T / 15"},null,"BM4",15,null,{"$f":"'TAB 16 PS Qualif'!C20","v":"T / 2"},null,{"$f":"'TAB 16 PS Qualif'!C22","v":"T / 10"},null,"2*21, SD 15"]
[null,null,null,"14:00:00","CM3",10,null,{"$f":"'TAB 16 PS Qualif'!C28","v":"T / 6"},null,{"$f":"'TAB 16 PS Qualif'!C30","v":"T / 14"},null,"CM4",14,null,{"$f":"'TAB 16 PS Qualif'!C27","v":"T / 3"},null,{"$f":"'TAB 16 PS Qualif'!C29","v":"T / 11"},null,"2*21, SD 15"]
[null,null,null,"14:50:00","DM3",12,null,{"$f":"'TAB 16 PS Qualif'!C35","v":"T / 5"},null,{"$f":"'TAB 16 PS Qualif'!C37","v":"T / 13"},null,"DM4",16,null,{"$f":"'TAB 16 PS Qualif'!C34","v":"T / 4"},null,{"$f":"'TAB 16 PS Qualif'!C36","v":"T / 12"},null,"2*21, SD 15"]
[null,null,null,"15:40:00","AM5",17,null,{"$f":"'TAB 16 PS Qualif'!C15","v":"T / 9"},null,{"$f":"'TAB 16 PS Qualif'!C16","v":"T / 16"},null,"AM6",21,null,{"$f":"'TAB 16 PS Qualif'!C13","v":"T / 1"},null,{"$f":"'TAB 16 PS Qualif'!C14","v":"T / 8"},null,"2*21, SD 15"]
[null,null,null,"16:30:00","BM5",19,null,{"$f":"'TAB 16 PS Qualif'!C22","v":"T / 10"},null,{"$f":"'TAB 16 PS Qualif'!C23","v":"T / 15"},null,"BM6",23,null,{"$f":"'TAB 16 PS Qualif'!C20","v":"T / 2"},null,{"$f":"'TAB 16 PS Qualif'!C21","v":"T / 7"},null,"2*21, SD 15"]
[null,null,null,"17:20:00","CM5",18,null,{"$f":"'TAB 16 PS Qualif'!C29","v":"T / 11"},null,{"$f":"'TAB 16 PS Qualif'!C30","v":"T / 14"},null,"CM6",22,null,{"$f":"'TAB 16 PS Qualif'!C27","v":"T / 3"},null,{"$f":"'TAB 16 PS Qualif'!C28","v":"T / 6"},null,"2*21, SD 15"]
[null,null,null,"18:10:00","DM5",20,null,{"$f":"'TAB 16 PS Qualif'!C36","v":"T / 12"},null,{"$f":"'TAB 16 PS Qualif'!C37","v":"T / 13"},null,"DM6",24,null,{"$f":"'TAB 16 PS Qualif'!C34","v":"T / 4"},null,{"$f":"'TAB 16 PS Qualif'!C35","v":"T / 5"},null,"2*21, SD 15"]
[null,null,null,"19:00:00","BARR 1",25,null,{"$f":"'TAB 16 PS Qualif'!L14","v":""},null,{"$f":"'TAB 16 PS Qualif'!L19","v":""},null,"BARR 2",26,null,{"$f":"'TAB 16 PS Qualif'!L22","v":""},null,{"$f":"'TAB 16 PS Qualif'!L27","v":""}]
[null,null,null,"19:50:00","FIN"]

{"sheet":"SCORE QUAL","index":4,"n_rows":43,"n_cols":36,"rows_kept":43,"cut":false,"hidden":false,"merged":[]}
[null,null,null,null,null,"TABLEAU DE SAISIE DE RESULTATS"]
[]
["DEBUT J1","09:00:00",null,null,null,"Saisir le résultats des sets dans les cases bordurées et colorées uniquement"]
["TEMPS","00:30:00"]
["DEBUT J2","00:00:00"]
[]
[null,null,"PHASE","JOUR","N° MATCH","HEURE","TER","EQ1",null,"EQ2","SCORE EQ1",null,"SCORE EQ2","SET 1 EQ1","SET 1 EQ2","SET 2 EQ1","SET 2 EQ2","SET 3 EQ1","SET 3 EQ2","POS 1","POS 2",null,null,null,"A","PTS","S+","S-","P+","P-","CS","CP","CL.I","RG",null,"CLA"]
[null,null,"A",1,1,{"$f":"B3","v":"09:00:00"},1,{"$f":"'TAB 16 PS Qualif'!C13","v":"T / 1"},"/",{"$f":"'TAB 16 PS Qualif'!C16","v":"T / 16"},{"$f":"SUM(IF(N8>O8,1,0),IF(P8>Q8,1,0),IF(R8>S8,1,0))","v":0},"/",{"$f":"SUM(IF(O8>N8,1,0),IF(Q8>P8,1,0),IF(S8>R8,1,0))","v":0},null,null,null,null,null,null,{"$f":"IF(K8=M8,\"\",IF(K8>M8,H8,J8))","v":""},{"$f":"IF(K8=M8,\"\",IF(K8<M8,H8,J8))","v":""},null,null,null,{"$f":"'TAB 16 PS Qualif'!C13","v":"T / 1"},{"$f":"COUNTIF(PLACE1,Y8)*2+COUNTIF(PLACE2,Y8)","v":0},{"$f":"SUMIF(LISTEE1,Y8,(SCEQ1))+SUMIF(LISTEE2,Y8,(SCEQ2))","v":0},{"$f":"SUMIF(LISTEE1,Y8,(SCEQ2))+SUMIF(LISTEE2,Y8,(SCEQ1))","v":0},{"$f":"(SUMPRODUCT((LISTEE1=Y8)*((S1EQ1)+(S2EQ1)+(S3EQ1))))+(SUMPRODUCT((LISTEE2=Y8)*((S1EQ2)+(S2EQ2)+(S3EQ3))))","v":0},{"$f":"(SUMPRODUCT((LISTEE2=Y8)*((S1EQ1)+(S2EQ1)+(S3EQ1))))+(SUMPRODUCT((LISTEE1=Y8)*((S1EQ2)+(S2EQ2)+(S3EQ3))))","v":0},{"$f":"IFERROR(AA8/AB8,0)","v":0},{"$f":"IFERROR(AC8/AD8,0)","v":0},{"$f":"Z8+AE8/100+AF8/100","v":0},{"$f":"IF(Z8=0,\"\",RANK(AG8,$AG$8:$AG$11))","v":""},1,{"$f":"IF(Z8=0,\"\",IF($AH$8=AI8,$Y$8,IF($AH$9=AI8,$Y$9,IF($AH$10=AI8,$Y$10,IF($AH$11=AI8,$Y$11)))))","v":""}]
[null,null,"B",1,2,{"$f":"B3","v":"09:00:00"},2,{"$f":"'TAB 16 PS Qualif'!C20","v":"T / 2"},"/",{"$f":"'TAB 16 PS Qualif'!C23","v":"T / 15"},{"$f":"SUM(IF(N9>O9,1,0),IF(P9>Q9,1,0),IF(R9>S9,1,0))","v":0},"/",{"$f":"SUM(IF(O9>N9,1,0),IF(Q9>P9,1,0),IF(S9>R9,1,0))","v":0},null,null,null,null,null,null,{"$f":"IF(K9=M9,\"\",IF(K9>M9,H9,J9))","v":""},{"$f":"IF(K9=M9,\"\",IF(K9<M9,H9,J9))","v":""},null,null,null,{"$f":"'TAB 16 PS Qualif'!C14","v":"T / 8"},{"$f":"COUNTIF(PLACE1,Y9)*2+COUNTIF(PLACE2,Y9)","v":0},{"$f":"SUMIF(LISTEE1,Y9,(SCEQ1))+SUMIF(LISTEE2,Y9,(SCEQ2))","v":0},{"$f":"SUMIF(LISTEE1,Y9,(SCEQ2))+SUMIF(LISTEE2,Y9,(SCEQ1))","v":0},{"$f":"(SUMPRODUCT((LISTEE1=Y9)*((S1EQ1)+(S2EQ1)+(S3EQ1))))+(SUMPRODUCT((LISTEE2=Y9)*((S1EQ2)+(S2EQ2)+(S3EQ3))))","v":0},{"$f":"(SUMPRODUCT((LISTEE2=Y9)*((S1EQ1)+(S2EQ1)+(S3EQ1))))+(SUMPRODUCT((LISTEE1=Y9)*((S1EQ2)+(S2EQ2)+(S3EQ3))))","v":0},{"$f":"IFERROR(AA9/AB9,0)","v":0},{"$f":"IFERROR(AC9/AD9,0)","v":0},{"$f":"Z9+AE9/100+AF9/100","v":0},{"$f":"IF(Z9=0,\"\",RANK(AG9,$AG$8:$AG$11))","v":""},2,{"$f":"IF(Z9=0,\"\",IF($AH$8=AI9,$Y$8,IF($AH$9=AI9,$Y$9,IF($AH$10=AI9,$Y$10,IF($AH$11=AI9,$Y$11)))))","v":""}]
[null,null,"C",1,3,{"$f":"F8+$B$4","v":"09:30:00"},1,{"$f":"'TAB 16 PS Qualif'!C27","v":"T / 3"},"/",{"$f":"'TAB 16 PS Qualif'!C30","v":"T / 14"},0,"/",0,null,null,null,null,null,null,"","",null,null,null,{"$f":"'TAB 16 PS Qualif'!C15","v":"T / 9"},{"$f":"COUNTIF(PLACE1,Y10)*2+COUNTIF(PLACE2,Y10)","v":0},{"$f":"SUMIF(LISTEE1,Y10,(SCEQ1))+SUMIF(LISTEE2,Y10,(SCEQ2))","v":0},{"$f":"SUMIF(LISTEE1,Y10,SCEQ2)+SUMIF(LISTEE2,Y10,SCEQ1)","v":0},{"$f":"(SUMPRODUCT((LISTEE1=Y10)*((S1EQ1)+(S2EQ1)+(S3EQ1))))+(SUMPRODUCT((LISTEE2=Y10)*((S1EQ2)+(S2EQ2)+(S3EQ3))))","v":0},{"$f":"(SUMPRODUCT((LISTEE2=Y10)*((S1EQ1)+(S2EQ1)+(S3EQ1))))+(SUMPRODUCT((LISTEE1=Y10)*((S1EQ2)+(S2EQ2)+(S3EQ3))))","v":0},0,0,0,{"$f":"IF(Z10=0,\"\",RANK(AG10,$AG$8:$AG$11))","v":""},3,{"$f":"IF(Z10=0,\"\",IF($AH$8=AI10,$Y$8,IF($AH$9=AI10,$Y$9,IF($AH$10=AI10,$Y$10,IF($AH$11=AI10,$Y$11)))))","v":""}]
[null,null,"D",1,4,"09:30:00",2,{"$f":"'TAB 16 PS Qualif'!C34","v":"T / 4"},"/",{"$f":"'TAB 16 PS Qualif'!C37","v":"T / 13"},0,"/",0,null,null,null,null,null,null,"","",null,null,null,{"$f":"'TAB 16 PS Qualif'!C16","v":"T / 16"},{"$f":"COUNTIF(PLACE1,Y11)*2+COUNTIF(PLACE2,Y11)","v":0},{"$f":"SUMIF(LISTEE1,Y11,(SCEQ1))+SUMIF(LISTEE2,Y11,(SCEQ2))","v":0},{"$f":"SUMIF(LISTEE1,Y11,SCEQ2)+SUMIF(LISTEE2,Y11,SCEQ1)","v":0},{"$f":"(SUMPRODUCT((LISTEE1=Y11)*((S1EQ1)+(S2EQ1)+(S3EQ1))))+(SUMPRODUCT((LISTEE2=Y11)*((S1EQ2)+(S2EQ2)+(S3EQ3))))","v":0},{"$f":"(SUMPRODUCT((LISTEE2=Y11)*((S1EQ1)+(S2EQ1)+(S3EQ1))))+(SUMPRODUCT((LISTEE1=Y11)*((S1EQ2)+(S2EQ2)+(S3EQ3))))","v":0},0,0,0,{"$f":"IF(Z11=0,\"\",RANK(AG11,$AG$8:$AG$11))","v":""},4,{"$f":"IF(Z11=0,\"\",IF($AH$8=AI11,$Y$8,IF($AH$9=AI11,$Y$9,IF($AH$10=AI11,$Y$10,IF($AH$11=AI11,$Y$11)))))","v":""}]
[null,null,"A",1,5,"10:00:00",1,{"$f":"'TAB 16 PS Qualif'!C14","v":"T / 8"},"/",{"$f":"'TAB 16 PS Qualif'!C15","v":"T / 9"},0,"/",0,null,null,null,null,null,null,"","",null,null,null,"B"]
[null,null,"B",1,6,"10:00:00",2,{"$f":"'TAB 16 PS Qualif'!C21","v":"T / 7"},"/",{"$f":"'TAB 16 PS Qualif'!C22","v":"T / 10"},0,"/",0,null,null,null,null,null,null,"","",null,null,null,{"$f":"'TAB 16 PS Qualif'!C20","v":"T / 2"},{"$f":"COUNTIF(PLACE1,Y13)*2+COUNTIF(PLACE2,Y13)","v":0},{"$f":"SUMIF(LISTEE1,Y13,(SCEQ1))+SUMIF(LISTEE2,Y13,(SCEQ2))","v":0},{"$f":"SUMIF(LISTEE1,Y13,SCEQ2)+SUMIF(LISTEE2,Y13,SCEQ1)","v":0},{"$f":"(SUMPRODUCT((LISTEE1=Y13)*((S1EQ1)+(S2EQ1)+(S3EQ1))))+(SUMPRODUCT((LISTEE2=Y13)*((S1EQ2)+(S2EQ2)+(S3EQ3))))","v":0},{"$f":"(SUMPRODUCT((LISTEE2=Y13)*((S1EQ1)+(S2EQ1)+(S3EQ1))))+(SUMPRODUCT((LISTEE1=Y13)*((S1EQ2)+(S2EQ2)+(S3EQ3))))","v":0},0,0,0,{"$f":"IF(Z13=0,\"\",RANK(AG13,$AG$13:$AG$16))","v":""},1,{"$f":"IF(Z13=0,\"\",IF($AH$13=AI13,$Y$13,IF($AH$14=AI13,$Y$14,IF($AH$15=AI13,$Y$15,IF($AH$16=AI13,$Y$16)))))","v":""}]
[null,null,"C",1,7,"10:30:00",1,{"$f":"'TAB 16 PS Qualif'!C28","v":"T / 6"},"/",{"$f":"'TAB 16 PS Qualif'!C29","v":"T / 11"},{"$f":"SUM(IF(N14>O14,1,0),IF(P14>Q14,1,0),IF(R14>S14,1,0))","v":0},"/",0,null,null,null,null,null,null,{"$f":"IF(K14=M14,\"\",IF(K14>M14,H14,J14))","v":""},"",null,null,null,{"$f":"'TAB 16 PS Qualif'!C21","v":"T / 7"},{"$f":"COUNTIF(PLACE1,Y14)*2+COUNTIF(PLACE2,Y14)","v":0},{"$f":"SUMIF(LISTEE1,Y14,(SCEQ1))+SUMIF(LISTEE2,Y14,(SCEQ2))","v":0},{"$f":"SUMIF(LISTEE1,Y14,SCEQ2)+SUMIF(LISTEE2,Y14,SCEQ1)","v":0},{"$f":"(SUMPRODUCT((LISTEE1=Y14)*((S1EQ1)+(S2EQ1)+(S3EQ1))))+(SUMPRODUCT((LISTEE2=Y14)*((S1EQ2)+(S2EQ2)+(S3EQ3))))","v":0},{"$f":"(SUMPRODUCT((LISTEE2=Y14)*((S1EQ1)+(S2EQ1)+(S3EQ1))))+(SUMPRODUCT((LISTEE1=Y14)*((S1EQ2)+(S2EQ2)+(S3EQ3))))","v":0},0,0,0,{"$f":"IF(Z14=0,\"\",RANK(AG14,$AG$13:$AG$16))","v":""},2,{"$f":"IF(Z14=0,\"\",IF($AH$13=AI14,$Y$13,IF($AH$14=AI14,$Y$14,IF($AH$15=AI14,$Y$15,IF($AH$16=AI14,$Y$16)))))","v":""}]
[null,null,"D",1,8,"10:30:00",2,{"$f":"'TAB 16 PS Qualif'!C35","v":"T / 5"},"/",{"$f":"'TAB 16 PS Qualif'!C36","v":"T / 12"},0,"/",0,null,null,null,null,null,null,"","",null,null,null,{"$f":"'TAB 16 PS Qualif'!C22","v":"T / 10"},{"$f":"COUNTIF(PLACE1,Y15)*2+COUNTIF(PLACE2,Y15)","v":0},{"$f":"SUMIF(LISTEE1,Y15,(SCEQ1))+SUMIF(LISTEE2,Y15,(SCEQ2))","v":0},{"$f":"SUMIF(LISTEE1,Y15,SCEQ2)+SUMIF(LISTEE2,Y15,SCEQ1)","v":0},{"$f":"(SUMPRODUCT((LISTEE1=Y15)*((S1EQ1)+(S2EQ1)+(S3EQ1))))+(SUMPRODUCT((LISTEE2=Y15)*((S1EQ2)+(S2EQ2)+(S3EQ3))))","v":0},{"$f":"(SUMPRODUCT((LISTEE2=Y15)*((S1EQ1)+(S2EQ1)+(S3EQ1))))+(SUMPRODUCT((LISTEE1=Y15)*((S1EQ2)+(S2EQ2)+(S3EQ3))))","v":0},0,0,0,{"$f":"IF(Z15=0,\"\",RANK(AG15,$AG$13:$AG$16))","v":""},3,{"$f":"IF(Z15=0,\"\",IF($AH$13=AI15,$Y$13,IF($AH$14=AI15,$Y$14,IF($AH$15=AI15,$Y$15,IF($AH$16=AI15,$Y$16)))))","v":""}]
[null,null,"A",1,9,"11:00:00",1,{"$f":"'TAB 16 PS Qualif'!C14","v":"T / 8"},"/",{"$f":"'TAB 16 PS Qualif'!C16","v":"T / 16"},0,"/",0,null,null,null,null,null,null,"","",null,null,null,{"$f":"'TAB 16 PS Qualif'!C23","v":"T / 15"},{"$f":"COUNTIF(PLACE1,Y16)*2+COUNTIF(PLACE2,Y16)","v":0},{"$f":"SUMIF(LISTEE1,Y16,(SCEQ1))+SUMIF(LISTEE2,Y16,(SCEQ2))","v":0},{"$f":"SUMIF(LISTEE1,Y16,SCEQ2)+SUMIF(LISTEE2,Y16,SCEQ1)","v":0},{"$f":"(SUMPRODUCT((LISTEE1=Y16)*((S1EQ1)+(S2EQ1)+(S3EQ1))))+(SUMPRODUCT((LISTEE2=Y16)*((S1EQ2)+(S2EQ2)+(S3EQ3))))","v":0},{"$f":"(SUMPRODUCT((LISTEE2=Y16)*((S1EQ1)+(S2EQ1)+(S3EQ1))))+(SUMPRODUCT((LISTEE1=Y16)*((S1EQ2)+(S2EQ2)+(S3EQ3))))","v":0},0,0,0,{"$f":"IF(Z16=0,\"\",RANK(AG16,$AG$13:$AG$16))","v":""},4,{"$f":"IF(Z16=0,\"\",IF($AH$13=AI16,$Y$13,IF($AH$14=AI16,$Y$14,IF($AH$15=AI16,$Y$15,IF($AH$16=AI16,$Y$16)))))","v":""}]
[null,null,"B",1,10,"11:00:00",2,{"$f":"'TAB 16 PS Qualif'!C21","v":"T / 7"},"/",{"$f":"'TAB 16 PS Qualif'!C23","v":"T / 15"},0,"/",0,null,null,null,null,null,null,"","",null,null,null,"C"]
[null,null,"C",1,11,"11:30:00",1,{"$f":"'TAB 16 PS Qualif'!C28","v":"T / 6"},"/",{"$f":"'TAB 16 PS Qualif'!C30","v":"T / 14"},0,"/",0,null,null,null,null,null,null,"","",null,null,null,{"$f":"'TAB 16 PS Qualif'!C27","v":"T / 3"},{"$f":"COUNTIF(PLACE1,Y18)*2+COUNTIF(PLACE2,Y18)","v":0},{"$f":"SUMIF(LISTEE1,Y18,(SCEQ1))+SUMIF(LISTEE2,Y18,(SCEQ2))","v":0},{"$f":"SUMIF(LISTEE1,Y18,SCEQ2)+SUMIF(LISTEE2,Y18,SCEQ1)","v":0},{"$f":"(SUMPRODUCT((LISTEE1=Y18)*((S1EQ1)+(S2EQ1)+(S3EQ1))))+(SUMPRODUCT((LISTEE2=Y18)*((S1EQ2)+(S2EQ2)+(S3EQ3))))","v":0},{"$f":"(SUMPRODUCT((LISTEE2=Y18)*((S1EQ1)+(S2EQ1)+(S3EQ1))))+(SUMPRODUCT((LISTEE1=Y18)*((S1EQ2)+(S2EQ2)+(S3EQ3))))","v":0},{"$f":"IFERROR(AA18/AB18,0)","v":0},0,{"$f":"Z18+AE18/100+AF18/100","v":0},{"$f":"IF(Z18=0,\"\",RANK(AG18,$AG$18:$AG$21))","v":""},1,{"$f":"IF(Z18=0,\"\",IF($AH$18=AI18,$Y$18,IF($AH$19=AI18,$Y$19,IF($AH$20=AI18,$Y$20,IF($AH$21=AI18,$Y$21)))))","v":""}]
[null,null,"D",1,12,"11:30:00",2,{"$f":"'TAB 16 PS Qualif'!C35","v":"T / 5"},"/",{"$f":"'TAB 16 PS Qualif'!C37","v":"T / 13"},0,"/",0,null,null,null,null,null,null,"","",null,null,null,{"$f":"'TAB 16 PS Qualif'!C28","v":"T / 6"},{"$f":"COUNTIF(PLACE1,Y19)*2+COUNTIF(PLACE2,Y19)","v":0},{"$f":"SUMIF(LISTEE1,Y19,(SCEQ1))+SUMIF(LISTEE2,Y19,(SCEQ2))","v":0},{"$f":"SUMIF(LISTEE1,Y19,SCEQ2)+SUMIF(LISTEE2,Y19,SCEQ1)","v":0},{"$f":"(SUMPRODUCT((LISTEE1=Y19)*((S1EQ1)+(S2EQ1)+(S3EQ1))))+(SUMPRODUCT((LISTEE2=Y19)*((S1EQ2)+(S2EQ2)+(S3EQ3))))","v":0},{"$f":"(SUMPRODUCT((LISTEE2=Y19)*((S1EQ1)+(S2EQ1)+(S3EQ1))))+(SUMPRODUCT((LISTEE1=Y19)*((S1EQ2)+(S2EQ2)+(S3EQ3))))","v":0},0,0,{"$f":"Z19+AE19/100+AF19/100","v":0},{"$f":"IF(Z19=0,\"\",RANK(AG19,$AG$18:$AG$21))","v":""},2,{"$f":"IF(Z19=0,\"\",IF($AH$18=AI19,$Y$18,IF($AH$19=AI19,$Y$19,IF($AH$20=AI19,$Y$20,IF($AH$21=AI19,$Y$21)))))","v":""}]
[null,null,"A",1,17,"12:00:00",1,{"$f":"'TAB 16 PS Qualif'!C13","v":"T / 1"},"/",{"$f":"'TAB 16 PS Qualif'!C15","v":"T / 9"},0,"/",0,null,null,null,null,null,null,"","",null,null,null,{"$f":"'TAB 16 PS Qualif'!C29","v":"T / 11"},{"$f":"COUNTIF(PLACE1,Y20)*2+COUNTIF(PLACE2,Y20)","v":0},{"$f":"SUMIF(LISTEE1,Y20,(SCEQ1))+SUMIF(LISTEE2,Y20,(SCEQ2))","v":0},{"$f":"SUMIF(LISTEE1,Y20,SCEQ2)+SUMIF(LISTEE2,Y20,SCEQ1)","v":0},{"$f":"(SUMPRODUCT((LISTEE1=Y20)*((S1EQ1)+(S2EQ1)+(S3EQ1))))+(SUMPRODUCT((LISTEE2=Y20)*((S1EQ2)+(S2EQ2)+(S3EQ3))))","v":0},{"$f":"(SUMPRODUCT((LISTEE2=Y20)*((S1EQ1)+(S2EQ1)+(S3EQ1))))+(SUMPRODUCT((LISTEE1=Y20)*((S1EQ2)+(S2EQ2)+(S3EQ3))))","v":0},0,0,0,"",3,{"$f":"IF(Z20=0,\"\",IF($AH$18=AI20,$Y$18,IF($AH$19=AI20,$Y$19,IF($AH$20=AI20,$Y$20,IF($AH$21=AI20,$Y$21)))))","v":""}]
[null,null,"B",1,18,"12:00:00",2,{"$f":"'TAB 16 PS Qualif'!C20","v":"T / 2"},"/",{"$f":"'TAB 16 PS Qualif'!C22","v":"T / 10"},0,"/",0,null,null,null,null,null,null,"","",null,null,null,{"$f":"'TAB 16 PS Qualif'!C30","v":"T / 14"},{"$f":"COUNTIF(PLACE1,Y21)*2+COUNTIF(PLACE2,Y21)","v":0},{"$f":"SUMIF(LISTEE1,Y21,(SCEQ1))+SUMIF(LISTEE2,Y21,(SCEQ2))","v":0},{"$f":"SUMIF(LISTEE1,Y21,SCEQ2)+SUMIF(LISTEE2,Y21,SCEQ1)","v":0},{"$f":"(SUMPRODUCT((LISTEE1=Y21)*((S1EQ1)+(S2EQ1)+(S3EQ1))))+(SUMPRODUCT((LISTEE2=Y21)*((S1EQ2)+(S2EQ2)+(S3EQ3))))","v":0},{"$f":"(SUMPRODUCT((LISTEE2=Y21)*((S1EQ1)+(S2EQ1)+(S3EQ1))))+(SUMPRODUCT((LISTEE1=Y21)*((S1EQ2)+(S2EQ2)+(S3EQ3))))","v":0},0,0,{"$f":"Z21+AE21/100+AF21/100","v":0},"",4,{"$f":"IF(Z21=0,\"\",IF($AH$18=AI21,$Y$18,IF($AH$19=AI21,$Y$19,IF($AH$20=AI21,$Y$20,IF($AH$21=AI21,$Y$21)))))","v":""}]
[null,null,"C",1,19,"12:30:00",1,{"$f":"'TAB 16 PS Qualif'!C27","v":"T / 3"},"/",{"$f":"'TAB 16 PS Qualif'!C29","v":"T / 11"},0,"/",0,null,null,null,null,null,null,"","",null,null,null,"D"]
[null,null,"D",1,20,"12:30:00",2,{"$f":"'TAB 16 PS Qualif'!C34","v":"T / 4"},"/",{"$f":"'TAB 16 PS Qualif'!C36","v":"T / 12"},0,"/",0,null,null,null,null,null,null,"","",null,null,null,{"$f":"'TAB 16 PS Qualif'!C34","v":"T / 4"},{"$f":"COUNTIF(PLACE1,Y23)*2+COUNTIF(PLACE2,Y23)","v":0},{"$f":"SUMIF(LISTEE1,Y23,(SCEQ1))+SUMIF(LISTEE2,Y23,(SCEQ2))","v":0},{"$f":"SUMIF(LISTEE1,Y23,SCEQ2)+SUMIF(LISTEE2,Y23,SCEQ1)","v":0},{"$f":"(SUMPRODUCT((LISTEE1=Y23)*((S1EQ1)+(S2EQ1)+(S3EQ1))))+(SUMPRODUCT((LISTEE2=Y23)*((S1EQ2)+(S2EQ2)+(S3EQ3))))","v":0},{"$f":"(SUMPRODUCT((LISTEE2=Y23)*((S1EQ1)+(S2EQ1)+(S3EQ1))))+(SUMPRODUCT((LISTEE1=Y23)*((S1EQ2)+(S2EQ2)+(S3EQ3))))","v":0},0,0,0,{"$f":"IF(Z23=0,\"\",RANK(AG23,$AG$23:$AG$26))","v":""},1,{"$f":"IF(Z23=0,\"\",IF($AH$23=AI23,$Y$23,IF($AH$24=AI23,$Y$24,IF($AH$25=AI23,$Y$25,IF($AH$26=AI23,$Y$26)))))","v":""}]
[null,null,"A",1,21,"13:00:00",1,{"$f":"'TAB 16 PS Qualif'!C15","v":"T / 9"},"/",{"$f":"'TAB 16 PS Qualif'!C16","v":"T / 16"},0,"/",0,null,null,null,null,null,null,"","",null,null,null,{"$f":"'TAB 16 PS Qualif'!C35","v":"T / 5"},{"$f":"COUNTIF(PLACE1,Y24)*2+COUNTIF(PLACE2,Y24)","v":0},{"$f":"SUMIF(LISTEE1,Y24,(SCEQ1))+SUMIF(LISTEE2,Y24,(SCEQ2))","v":0},{"$f":"SUMIF(LISTEE1,Y24,SCEQ2)+SUMIF(LISTEE2,Y24,SCEQ1)","v":0},{"$f":"(SUMPRODUCT((LISTEE1=Y24)*((S1EQ1)+(S2EQ1)+(S3EQ1))))+(SUMPRODUCT((LISTEE2=Y24)*((S1EQ2)+(S2EQ2)+(S3EQ3))))","v":0},{"$f":"(SUMPRODUCT((LISTEE2=Y24)*((S1EQ1)+(S2EQ1)+(S3EQ1))))+(SUMPRODUCT((LISTEE1=Y24)*((S1EQ2)+(S2EQ2)+(S3EQ3))))","v":0},0,0,0,{"$f":"IF(Z24=0,\"\",RANK(AG24,$AG$23:$AG$26))","v":""},2,{"$f":"IF(Z24=0,\"\",IF($AH$23=AI24,$Y$23,IF($AH$24=AI24,$Y$24,IF($AH$25=AI24,$Y$25,IF($AH$26=AI24,$Y$26)))))","v":""}]
[null,null,"B",1,22,"13:00:00",2,{"$f":"'TAB 16 PS Qualif'!C22","v":"T / 10"},"/",{"$f":"'TAB 16 PS Qualif'!C23","v":"T / 15"},0,"/",0,null,null,null,null,null,null,"","",null,null,null,{"$f":"'TAB 16 PS Qualif'!C36","v":"T / 12"},{"$f":"COUNTIF(PLACE1,Y25)*2+COUNTIF(PLACE2,Y25)","v":0},{"$f":"SUMIF(LISTEE1,Y25,(SCEQ1))+SUMIF(LISTEE2,Y25,(SCEQ2))","v":0},{"$f":"SUMIF(LISTEE1,Y25,SCEQ2)+SUMIF(LISTEE2,Y25,SCEQ1)","v":0},{"$f":"(SUMPRODUCT((LISTEE1=Y25)*((S1EQ1)+(S2EQ1)+(S3EQ1))))+(SUMPRODUCT((LISTEE2=Y25)*((S1EQ2)+(S2EQ2)+(S3EQ3))))","v":0},{"$f":"(SUMPRODUCT((LISTEE2=Y25)*((S1EQ1)+(S2EQ1)+(S3EQ1))))+(SUMPRODUCT((LISTEE1=Y25)*((S1EQ2)+(S2EQ2)+(S3EQ3))))","v":0},0,0,0,"",3,""]
[null,null,"C",1,23,"13:30:00",1,{"$f":"'TAB 16 PS Qualif'!C29","v":"T / 11"},"/",{"$f":"'TAB 16 PS Qualif'!C30","v":"T / 14"},0,"/",0,null,null,null,null,null,null,"","",null,null,null,{"$f":"'TAB 16 PS Qualif'!C37","v":"T / 13"},{"$f":"COUNTIF(PLACE1,Y26)*2+COUNTIF(PLACE2,Y26)","v":0},{"$f":"SUMIF(LISTEE1,Y26,(SCEQ1))+SUMIF(LISTEE2,Y26,(SCEQ2))","v":0},{"$f":"SUMIF(LISTEE1,Y26,SCEQ2)+SUMIF(LISTEE2,Y26,SCEQ1)","v":0},{"$f":"(SUMPRODUCT((LISTEE1=Y26)*((S1EQ1)+(S2EQ1)+(S3EQ1))))+(SUMPRODUCT((LISTEE2=Y26)*((S1EQ2)+(S2EQ2)+(S3EQ3))))","v":0},{"$f":"(SUMPRODUCT((LISTEE2=Y26)*((S1EQ1)+(S2EQ1)+(S3EQ1))))+(SUMPRODUCT((LISTEE1=Y26)*((S1EQ2)+(S2EQ2)+(S3EQ3))))","v":0},0,0,0,"",4,{"$f":"IF(Z26=0,\"\",IF($AH$23=AI26,$Y$23,IF($AH$24=AI26,$Y$24,IF($AH$25=AI26,$Y$25,IF($AH$26=AI26,$Y$26)))))","v":""}]
[null,null,"D",1,24,"13:30:00",2,{"$f":"'TAB 16 PS Qualif'!C36","v":"T / 12"},"/",{"$f":"'TAB 16 PS Qualif'!C37","v":"T / 13"},0,"/",0,null,null,null,null,null,null,{"$f":"IF(K27=M27,\"\",IF(K27>M27,H27,J27))","v":""},""]
[null,null,"A",1,25,"14:00:00",3,{"$f":"'TAB 16 PS Qualif'!C13","v":"T / 1"},"/",{"$f":"'TAB 16 PS Qualif'!C14","v":"T / 8"},{"$f":"SUM(IF(N28>O28,1,0),IF(P28>Q28,1,0),IF(R28>S28,1,0))","v":0},"/",{"$f":"SUM(IF(O28>N28,1,0),IF(Q28>P28,1,0),IF(S28>R28,1,0))","v":0},null,null,null,null,null,null,{"$f":"IF(K28=M28,\"\",IF(K28>M28,H28,J28))","v":""},{"$f":"IF(K28=M28,\"\",IF(K28<M28,H28,J28))","v":""}]
[null,null,"B",1,26,"14:00:00",4,{"$f":"'TAB 16 PS Qualif'!C20","v":"T / 2"},"/",{"$f":"'TAB 16 PS Qualif'!C21","v":"T / 7"},0,"/",0,null,null,null,null,null,null,"",""]
[null,null,"C",1,27,"14:30:00",5,{"$f":"'TAB 16 PS Qualif'!C27","v":"T / 3"},"/",{"$f":"'TAB 16 PS Qualif'!C28","v":"T / 6"},0,"/",0,null,null,null,null,null,null,"",""]
[null,null,"D",1,28,"14:30:00",6,{"$f":"'TAB 16 PS Qualif'!C34","v":"T / 4"},"/",{"$f":"'TAB 16 PS Qualif'!C35","v":"T / 5"},0,"/",0,null,null,null,null,null,null,"",""]
[null,null,"BARR",1,29,{"$f":"F26+$B$4","v":"14:00:00"},1,{"$f":"AJ9","v":""},"/",{"$f":"AJ24","v":""},0,"/",0,null,null,null,null,null,null,{"$f":"IF(K32=M32,\"\",IF(K32>M32,H32,J32))","v":""},""]
[null,null,"BARR",1,30,{"$f":"F27+$B$4","v":"14:00:00"},2,{"$f":"AJ14","v":""},"/",{"$f":"AJ19","v":""},0,"/",0,null,null,null,null,null,null,{"$f":"IF(K33=M33,\"\",IF(K33>M33,H33,J33))","v":""},""]
[null,null,"BARR",1,31,"14:30:00",1,null,"/",null,0,"/",0,null,null,null,null,null,null,"",""]
[null,null,"BARR",1,32,"14:30:00",2,null,"/",null,0,"/",0,null,null,null,null,null,null,"",""]
[null,null,"1/4",1,33,"15:00:00",1,null,"/",null,0,"/",0,null,null,null,null,null,null,"",""]
[null,null,"1/4",1,34,"15:00:00",2,null,"/",null,0,"/",0,null,null,null,null,null,null,"",""]
[null,null,"1/4",1,35,"15:30:00",1,null,"/",{"$f":"T34","v":""},0,"/",0,null,null,null,null,null,null,"",""]
[null,null,"1/4",1,36,"15:30:00",2,null,"/",null,0,"/",0,null,null,null,null,null,null,"",""]
[null,null,"1/2",1,37,"16:00:00",null,null,"/",{"$f":"T37","v":""},0,"/",0,null,null,null,null,null,null,"",""]
[null,null,"1/2",1,38,{"$f":"F40+$B$4","v":"16:30:00"},null,{"$f":"T39","v":""},"/",{"$f":"T38","v":""},0,"/",0,null,null,null,null,null,null,"",""]
[null,null,"3-4",1,39,{"$f":"F41+$B$4","v":"17:00:00"},null,{"$f":"U40","v":""},"/",{"$f":"U41","v":""},0,"/",0,null,null,null,null,null,null,"",""]
[null,null,"F",1,40,{"$f":"F42+$B$4","v":"17:30:00"},null,{"$f":"T40","v":""},"/",{"$f":"T41","v":""},0,"/",0,null,null,null,null,null,null,"",""]

{"sheet":"TAB 16 PS Qualif","index":5,"n_rows":46,"n_cols":13,"rows_kept":46,"cut":false,"hidden":false,"merged":[[0,12,6,13],[5,3,5,11],[0,3,3,11],[4,3,4,7],[4,8,4,9],[4,10,4,11],[6,3,6,11]]}
[null,null,null,{"$f":"IF('LISTE ENGAGES'!R3=\"\",'LISTE ENGAGES'!Q3,'LISTE ENGAGES'!R3)","v":"APPELATION TOURNOI"},null,null,null,null,null,null,null,null,{"$f":"IF('LISTE ENGAGES'!$R$10<>\"\",'LISTE ENGAGES'!$R$10,'LISTE ENGAGES'!$Q$10)","v":"ORGANISATEUR"}]
[]
[]
[]
[null,null,null,{"$f":"IF('LISTE ENGAGES'!R4=\"\",'LISTE ENGAGES'!Q4,'LISTE ENGAGES'!R4)","v":"LIEU"},null,null,null,null,{"$f":"IF('LISTE ENGAGES'!R8=\"\",'LISTE ENGAGES'!Q8,'LISTE ENGAGES'!R8)","v":"DATE FIN"},null,{"$f":"IF('LISTE ENGAGES'!R9=\"\",'LISTE ENGAGES'!Q9,'LISTE ENGAGES'!R9)","v":"GENRE"}]
[null,null,null,{"$f":"IF('LISTE ENGAGES'!R5=\"\",'LISTE ENGAGES'!Q5,'LISTE ENGAGES'!R5)","v":"TYPE"}]
[null,null,null,"TABLEAU DE QUALIFICATION"]
[]
[]
[null,null,"POULES",null,"RESULTATS",null,null,null,"CLASSEMENT",null,null,"BARRAGES"]
[null,null,null,null,null,null,null,null,"POULE"]
[null,null,null,"TS1-TS16","(1)",{"$f":"IF('SCORE QUAL'!K8='SCORE QUAL'!M8,\"\",CONCATENATE('SCORE QUAL'!K8,\" / \",'SCORE QUAL'!M8,\" (\",'SCORE QUAL'!N8,\"-\",'SCORE QUAL'!O8,\")\",\" (\",'SCORE QUAL'!P8,\"-\",'SCORE QUAL'!Q8,\")\",\" (\",'SCORE QUAL'!R8,\"-\",'SCORE QUAL'!S8,\")\"))","v":""}]
[null,"T1",{"$f":"CONCATENATE('EMARG Tableau Qualif'!C9,\" / \",'EMARG Tableau Qualif'!G9)","v":"T / 1"},"TS8-TS9","(5)",{"$f":"IF('SCORE QUAL'!K12='SCORE QUAL'!M12,\"\",CONCATENATE('SCORE QUAL'!K12,\" / \",'SCORE QUAL'!M12,\" (\",'SCORE QUAL'!N12,\"-\",'SCORE QUAL'!O12,\")\",\" (\",'SCORE QUAL'!P12,\"-\",'SCORE QUAL'!Q12,\")\",\" (\",'SCORE QUAL'!R12,\"-\",'SCORE QUAL'!S12,\")\"))","v":""},null,1,{"$f":"'SCORE QUAL'!AJ8","v":""},"Qualifié"]
["A","T8",{"$f":"CONCATENATE('EMARG Tableau Qualif'!C16,\" / \",'EMARG Tableau Qualif'!G16)","v":"T / 8"},"TS8-TS16","(9)",{"$f":"IF('SCORE QUAL'!K16='SCORE QUAL'!M16,\"\",CONCATENATE('SCORE QUAL'!K16,\" / \",'SCORE QUAL'!M16,\" (\",'SCORE QUAL'!N16,\"-\",'SCORE QUAL'!O16,\")\",\" (\",'SCORE QUAL'!P16,\"-\",'SCORE QUAL'!Q16,\")\",\" (\",'SCORE QUAL'!R16,\"-\",'SCORE QUAL'!S16,\")\"))","v":""},null,2,{"$f":"'SCORE QUAL'!AJ9","v":""},null,null,{"$f":"'SCORE QUAL'!H32","v":""}]
[null,"T9",{"$f":"CONCATENATE('EMARG Tableau Qualif'!C17,\" / \",'EMARG Tableau Qualif'!G17)","v":"T / 9"},"TS1-TS9","(13)",{"$f":"IF('SCORE QUAL'!K20='SCORE QUAL'!M20,\"\",CONCATENATE('SCORE QUAL'!K20,\" / \",'SCORE QUAL'!M20,\" (\",'SCORE QUAL'!N20,\"-\",'SCORE QUAL'!O20,\")\",\" (\",'SCORE QUAL'!P20,\"-\",'SCORE QUAL'!Q20,\")\",\" (\",'SCORE QUAL'!R20,\"-\",'SCORE QUAL'!S20,\")\"))","v":""},null,3,{"$f":"'SCORE QUAL'!AJ10","v":""},17]
[null,"T16",{"$f":"CONCATENATE('EMARG Tableau Qualif'!C24,\" / \",'EMARG Tableau Qualif'!G24)","v":"T / 16"},"TS9-TS16","(17)",{"$f":"IF('SCORE QUAL'!K24='SCORE QUAL'!M24,\"\",CONCATENATE('SCORE QUAL'!K24,\" / \",'SCORE QUAL'!M24,\" (\",'SCORE QUAL'!N24,\"-\",'SCORE QUAL'!O24,\")\",\" (\",'SCORE QUAL'!P24,\"-\",'SCORE QUAL'!Q24,\")\",\" (\",'SCORE QUAL'!R24,\"-\",'SCORE QUAL'!S24,\")\"))","v":""},null,4,{"$f":"'SCORE QUAL'!AJ11","v":""},25,null,"(25)",{"$f":"'SCORE QUAL'!T32","v":""}]
[null,null,null,"TS1-TS8","(21)",{"$f":"IF('SCORE QUAL'!K28='SCORE QUAL'!M28,\"\",CONCATENATE('SCORE QUAL'!K28,\" / \",'SCORE QUAL'!M28,\" (\",'SCORE QUAL'!N28,\"-\",'SCORE QUAL'!O28,\")\",\" (\",'SCORE QUAL'!P28,\"-\",'SCORE QUAL'!Q28,\")\",\" (\",'SCORE QUAL'!R28,\"-\",'SCORE QUAL'!S28,\")\"))","v":""},null,null,null,null,null,null,{"$f":"IF('SCORE QUAL'!K32='SCORE QUAL'!M32,\"\",CONCATENATE('SCORE QUAL'!K32,\" / \",'SCORE QUAL'!M32,\" (\",'SCORE QUAL'!N32,\"-\",'SCORE QUAL'!O32,\")\",\" (\",'SCORE QUAL'!P32,\"-\",'SCORE QUAL'!Q32,\")\",\" (\",'SCORE QUAL'!R32,\"-\",'SCORE QUAL'!S32,\")\"))","v":""}]
[]
[null,null,null,"TS2-TS15","(3)",{"$f":"IF('SCORE QUAL'!K9='SCORE QUAL'!M9,\"\",CONCATENATE('SCORE QUAL'!K9,\" / \",'SCORE QUAL'!M9,\" (\",'SCORE QUAL'!N9,\"-\",'SCORE QUAL'!O9,\")\",\" (\",'SCORE QUAL'!P9,\"-\",'SCORE QUAL'!Q9,\")\",\" (\",'SCORE QUAL'!R9,\"-\",'SCORE QUAL'!S9,\")\"))","v":""},null,null,null,null,null,{"$f":"'SCORE QUAL'!J32","v":""}]
[null,"T2",{"$f":"CONCATENATE('EMARG Tableau Qualif'!C10,\" / \",'EMARG Tableau Qualif'!G10)","v":"T / 2"},"TS7-TS10","(7)",{"$f":"IF('SCORE QUAL'!K13='SCORE QUAL'!M13,\"\",CONCATENATE('SCORE QUAL'!K13,\" / \",'SCORE QUAL'!M13,\" (\",'SCORE QUAL'!N13,\"-\",'SCORE QUAL'!O13,\")\",\" (\",'SCORE QUAL'!P13,\"-\",'SCORE QUAL'!Q13,\")\",\" (\",'SCORE QUAL'!R13,\"-\",'SCORE QUAL'!S13,\")\"))","v":""},null,1,{"$f":"'SCORE QUAL'!AJ13","v":""},"Qualifié",null,"Vainqueurs :","Qualifiés"]
["B","T7",{"$f":"CONCATENATE('EMARG Tableau Qualif'!C15,\" / \",'EMARG Tableau Qualif'!G15)","v":"T / 7"},"TS7-TS15","(11)",{"$f":"IF('SCORE QUAL'!K17='SCORE QUAL'!M17,\"\",CONCATENATE('SCORE QUAL'!K17,\" / \",'SCORE QUAL'!M17,\" (\",'SCORE QUAL'!N17,\"-\",'SCORE QUAL'!O17,\")\",\" (\",'SCORE QUAL'!P17,\"-\",'SCORE QUAL'!Q17,\")\",\" (\",'SCORE QUAL'!R17,\"-\",'SCORE QUAL'!S17,\")\"))","v":""},null,2,{"$f":"'SCORE QUAL'!AJ14","v":""},null,null,"Perdants : ","17"]
[null,"T10",{"$f":"CONCATENATE('EMARG Tableau Qualif'!C18,\" / \",'EMARG Tableau Qualif'!G18)","v":"T / 10"},"TS2-TS10","(15)",{"$f":"IF('SCORE QUAL'!K21='SCORE QUAL'!M21,\"\",CONCATENATE('SCORE QUAL'!K21,\" / \",'SCORE QUAL'!M21,\" (\",'SCORE QUAL'!N21,\"-\",'SCORE QUAL'!O21,\")\",\" (\",'SCORE QUAL'!P21,\"-\",'SCORE QUAL'!Q21,\")\",\" (\",'SCORE QUAL'!R21,\"-\",'SCORE QUAL'!S21,\")\"))","v":""},null,3,{"$f":"'SCORE QUAL'!AJ15","v":""},17,null,{"$f":"'SCORE QUAL'!H33","v":""}]
[null,"T15",{"$f":"CONCATENATE('EMARG Tableau Qualif'!C23,\" / \",'EMARG Tableau Qualif'!G23)","v":"T / 15"},"TS10-TS15","(19)",{"$f":"IF('SCORE QUAL'!K25='SCORE QUAL'!M25,\"\",CONCATENATE('SCORE QUAL'!K25,\" / \",'SCORE QUAL'!M25,\" (\",'SCORE QUAL'!N25,\"-\",'SCORE QUAL'!O25,\")\",\" (\",'SCORE QUAL'!P25,\"-\",'SCORE QUAL'!Q25,\")\",\" (\",'SCORE QUAL'!R25,\"-\",'SCORE QUAL'!S25,\")\"))","v":""},null,4,{"$f":"'SCORE QUAL'!AJ16","v":""},25]
[null,null,null,"TS2-TS7","(23)",{"$f":"IF('SCORE QUAL'!K29='SCORE QUAL'!M29,\"\",CONCATENATE('SCORE QUAL'!K29,\" / \",'SCORE QUAL'!M29,\" (\",'SCORE QUAL'!N29,\"-\",'SCORE QUAL'!O29,\")\",\" (\",'SCORE QUAL'!P29,\"-\",'SCORE QUAL'!Q29,\")\",\" (\",'SCORE QUAL'!R29,\"-\",'SCORE QUAL'!S29,\")\"))","v":""},null,null,null,null,null,"(26)",{"$f":"'SCORE QUAL'!T33","v":""}]
[null,null,null,null,null,null,null,null,null,null,null,null,{"$f":"IF('SCORE QUAL'!K33='SCORE QUAL'!M33,\"\",CONCATENATE('SCORE QUAL'!K33,\" / \",'SCORE QUAL'!M33,\" (\",'SCORE QUAL'!N33,\"-\",'SCORE QUAL'!O33,\")\",\" (\",'SCORE QUAL'!P33,\"-\",'SCORE QUAL'!Q33,\")\",\" (\",'SCORE QUAL'!R33,\"-\",'SCORE QUAL'!S33,\")\"))","v":""}]
[null,null,null,"TS3-TS14","(2)",{"$f":"IF('SCORE QUAL'!K10='SCORE QUAL'!M10,\"\",CONCATENATE('SCORE QUAL'!K10,\" / \",'SCORE QUAL'!M10,\" (\",'SCORE QUAL'!N10,\"-\",'SCORE QUAL'!O10,\")\",\" (\",'SCORE QUAL'!P10,\"-\",'SCORE QUAL'!Q10,\")\",\" (\",'SCORE QUAL'!R10,\"-\",'SCORE QUAL'!S10,\")\"))","v":""}]
[null,"T3",{"$f":"CONCATENATE('EMARG Tableau Qualif'!C11,\" / \",'EMARG Tableau Qualif'!G11)","v":"T / 3"},"TS6-TS11","(6)",{"$f":"IF('SCORE QUAL'!K14='SCORE QUAL'!M14,\"\",CONCATENATE('SCORE QUAL'!K14,\" / \",'SCORE QUAL'!M14,\" (\",'SCORE QUAL'!N14,\"-\",'SCORE QUAL'!O14,\")\",\" (\",'SCORE QUAL'!P14,\"-\",'SCORE QUAL'!Q14,\")\",\" (\",'SCORE QUAL'!R14,\"-\",'SCORE QUAL'!S14,\")\"))","v":""},null,1,{"$f":"'SCORE QUAL'!AJ18","v":""},"Qualifié",null,{"$f":"'SCORE QUAL'!J33","v":""}]
["C","T6",{"$f":"CONCATENATE('EMARG Tableau Qualif'!C14,\" / \",'EMARG Tableau Qualif'!G14)","v":"T / 6"},"TS6-TS14","(10)",{"$f":"IF('SCORE QUAL'!K18='SCORE QUAL'!M18,\"\",CONCATENATE('SCORE QUAL'!K18,\" / \",'SCORE QUAL'!M18,\" (\",'SCORE QUAL'!N18,\"-\",'SCORE QUAL'!O18,\")\",\" (\",'SCORE QUAL'!P18,\"-\",'SCORE QUAL'!Q18,\")\",\" (\",'SCORE QUAL'!R18,\"-\",'SCORE QUAL'!S18,\")\"))","v":""},null,2,{"$f":"'SCORE QUAL'!AJ19","v":""},null,null,"CLASSEMENT"]
[null,"T11",{"$f":"CONCATENATE('EMARG Tableau Qualif'!C19,\" / \",'EMARG Tableau Qualif'!G19)","v":"T / 11"},"TS3-TS11","(14)",{"$f":"IF('SCORE QUAL'!K22='SCORE QUAL'!M22,\"\",CONCATENATE('SCORE QUAL'!K22,\" / \",'SCORE QUAL'!M22,\" (\",'SCORE QUAL'!N22,\"-\",'SCORE QUAL'!O22,\")\",\" (\",'SCORE QUAL'!P22,\"-\",'SCORE QUAL'!Q22,\")\",\" (\",'SCORE QUAL'!R22,\"-\",'SCORE QUAL'!S22,\")\"))","v":""},null,3,{"$f":"'SCORE QUAL'!AJ20","v":""},17]
[null,"T14",{"$f":"CONCATENATE('EMARG Tableau Qualif'!C22,\" / \",'EMARG Tableau Qualif'!G22)","v":"T / 14"},"TS11-TS14","(18)",{"$f":"IF('SCORE QUAL'!K26='SCORE QUAL'!M26,\"\",CONCATENATE('SCORE QUAL'!K26,\" / \",'SCORE QUAL'!M26,\" (\",'SCORE QUAL'!N26,\"-\",'SCORE QUAL'!O26,\")\",\" (\",'SCORE QUAL'!P26,\"-\",'SCORE QUAL'!Q26,\")\",\" (\",'SCORE QUAL'!R26,\"-\",'SCORE QUAL'!S26,\")\"))","v":""},null,4,{"$f":"'SCORE QUAL'!AJ21","v":""},25,null,"Rang","NOM "]
[null,null,null,"TS3-TS6","(22)",{"$f":"IF('SCORE QUAL'!K30='SCORE QUAL'!M30,\"\",CONCATENATE('SCORE QUAL'!K30,\" / \",'SCORE QUAL'!M30,\" (\",'SCORE QUAL'!N30,\"-\",'SCORE QUAL'!O30,\")\",\" (\",'SCORE QUAL'!P30,\"-\",'SCORE QUAL'!Q30,\")\",\" (\",'SCORE QUAL'!R30,\"-\",'SCORE QUAL'!S30,\")\"))","v":""},null,null,null,null,null,"Qualifié",{"$f":"I13","v":""}]
[null,null,null,null,null,null,null,null,null,null,null,"Qualifié",{"$f":"I20","v":""}]
[null,null,null,"TS4-TS13","(4)",{"$f":"IF('SCORE QUAL'!K11='SCORE QUAL'!M11,\"\",CONCATENATE('SCORE QUAL'!K11,\" / \",'SCORE QUAL'!M11,\" (\",'SCORE QUAL'!N11,\"-\",'SCORE QUAL'!O11,\")\",\" (\",'SCORE QUAL'!P11,\"-\",'SCORE QUAL'!Q11,\")\",\" (\",'SCORE QUAL'!R11,\"-\",'SCORE QUAL'!S11,\")\"))","v":""},null,null,null,null,null,"Qualifié",{"$f":"I27","v":""}]
[null,"T4",{"$f":"CONCATENATE('EMARG Tableau Qualif'!C12,\" / \",'EMARG Tableau Qualif'!G12)","v":"T / 4"},"TS5-TS12","(8)",{"$f":"IF('SCORE QUAL'!K15='SCORE QUAL'!M15,\"\",CONCATENATE('SCORE QUAL'!K15,\" / \",'SCORE QUAL'!M15,\" (\",'SCORE QUAL'!N15,\"-\",'SCORE QUAL'!O15,\")\",\" (\",'SCORE QUAL'!P15,\"-\",'SCORE QUAL'!Q15,\")\",\" (\",'SCORE QUAL'!R15,\"-\",'SCORE QUAL'!S15,\")\"))","v":""},null,1,{"$f":"'SCORE QUAL'!AJ23","v":""},"Qualifié",null,"Qualifié",{"$f":"I34","v":""}]
["D","T5",{"$f":"CONCATENATE('EMARG Tableau Qualif'!C13,\" / \",'EMARG Tableau Qualif'!G13)","v":"T / 5"},"TS5-TS13","(12)",{"$f":"IF('SCORE QUAL'!K19='SCORE QUAL'!M19,\"\",CONCATENATE('SCORE QUAL'!K19,\" / \",'SCORE QUAL'!M19,\" (\",'SCORE QUAL'!N19,\"-\",'SCORE QUAL'!O19,\")\",\" (\",'SCORE QUAL'!P19,\"-\",'SCORE QUAL'!Q19,\")\",\" (\",'SCORE QUAL'!R19,\"-\",'SCORE QUAL'!S19,\")\"))","v":""},null,2,{"$f":"'SCORE QUAL'!AJ24","v":""},null,null,"Qualifié",{"$f":"M16","v":""}]
[null,"T12",{"$f":"CONCATENATE('EMARG Tableau Qualif'!C20,\" / \",'EMARG Tableau Qualif'!G20)","v":"T / 12"},"TS4-TS12","(16)",{"$f":"IF('SCORE QUAL'!K23='SCORE QUAL'!M23,\"\",CONCATENATE('SCORE QUAL'!K23,\" / \",'SCORE QUAL'!M23,\" (\",'SCORE QUAL'!N23,\"-\",'SCORE QUAL'!O23,\")\",\" (\",'SCORE QUAL'!P23,\"-\",'SCORE QUAL'!Q23,\")\",\" (\",'SCORE QUAL'!R23,\"-\",'SCORE QUAL'!S23,\")\"))","v":""},null,3,{"$f":"'SCORE QUAL'!AJ25","v":""},17,null,"Qualifié",{"$f":"M24","v":""}]
[null,"T13",{"$f":"CONCATENATE('EMARG Tableau Qualif'!C21,\" / \",'EMARG Tableau Qualif'!G21)","v":"T / 13"},"TS12-TS13","(20)",{"$f":"IF('SCORE QUAL'!K27='SCORE QUAL'!M27,\"\",CONCATENATE('SCORE QUAL'!K27,\" / \",'SCORE QUAL'!M27,\" (\",'SCORE QUAL'!N27,\"-\",'SCORE QUAL'!O27,\")\",\" (\",'SCORE QUAL'!P27,\"-\",'SCORE QUAL'!Q27,\")\",\" (\",'SCORE QUAL'!R27,\"-\",'SCORE QUAL'!S27,\")\"))","v":""},null,4,{"$f":"'SCORE QUAL'!AJ26","v":""},25,null,17,{"$f":"'SCORE QUAL'!U32","v":""}]
[null,null,null,"TS4-TS5","(24)",{"$f":"IF('SCORE QUAL'!K31='SCORE QUAL'!M31,\"\",CONCATENATE('SCORE QUAL'!K31,\" / \",'SCORE QUAL'!M31,\" (\",'SCORE QUAL'!N31,\"-\",'SCORE QUAL'!O31,\")\",\" (\",'SCORE QUAL'!P31,\"-\",'SCORE QUAL'!Q31,\")\",\" (\",'SCORE QUAL'!R31,\"-\",'SCORE QUAL'!S31,\")\"))","v":""},null,null,null,null,null,17,{"$f":"'SCORE QUAL'!U33","v":""}]
[null,null,null,null,null,null,null,null,null,null,null,17,{"$f":"I15","v":""}]
[null,null,null,null,null,null,null,null,null,null,null,17,{"$f":"I22","v":""}]
[null,null,null,null,null,null,null,null,null,null,null,17,{"$f":"I29","v":""}]
[null,null,null,null,null,null,null,null,null,null,null,17,{"$f":"I36","v":""}]
[null,null,null,null,null,null,null,null,null,null,null,25,{"$f":"I16","v":""}]
[null,null,null,null,null,null,null,null,null,null,null,25,{"$f":"I23","v":""}]
[null,null,null,null,null,null,null,null,null,null,null,25,{"$f":"I30","v":""}]
[null,null,null,null,null,null,null,null,null,null,null,25,{"$f":"I37","v":""}]

{"sheet":"EMARG M Tableau PRIN","index":6,"n_rows":29,"n_cols":14,"rows_kept":29,"cut":false,"hidden":false,"merged":[[5,3,5,13],[1,3,2,12],[1,13,3,13],[3,3,3,6],[3,7,3,11],[4,3,4,13]]}
[]
[null,null,null,{"$f":"IF('LISTE ENGAGES'!R3=\"\",'LISTE ENGAGES'!Q3,'LISTE ENGAGES'!R3)","v":"APPELATION TOURNOI"},null,null,null,null,null,null,null,null,null,{"$f":"IF('LISTE ENGAGES'!R10=\"\",'LISTE ENGAGES'!Q10,'LISTE ENGAGES'!R10)","v":"ORGANISATEUR"}]
[]
[null,null,null,{"$f":"IF('LISTE ENGAGES'!R4=\"\",'LISTE ENGAGES'!Q4,'LISTE ENGAGES'!R4)","v":"LIEU"},null,null,null,{"$f":"IF('LISTE ENGAGES'!R8=\"\",'LISTE ENGAGES'!Q8,'LISTE ENGAGES'!R8)","v":"DATE FIN"},null,null,null,null,{"$f":"IF('LISTE ENGAGES'!R9=\"\",'LISTE ENGAGES'!Q9,'LISTE ENGAGES'!R9)","v":"GENRE"}]
[null,null,null,{"$f":"IF('LISTE ENGAGES'!R5=\"\",'LISTE ENGAGES'!Q5,'LISTE ENGAGES'!R5)","v":"TYPE"}]
[null,null,null,"FEUILLE EMARGEMENT"]
[]
["N°",null,"NOM","PRENOM","LIC","CLUB","NOM","PRENOM","LIC","CLUB","pts","tir","SIGNATURE JOUEUR1","SIGNATURE JOUEUR2"]
[1,null,"T",null,null,null,1]
[2,null,"T",null,null,null,2]
[3,null,"T",null,null,null,3]
[4,null,"T",null,null,null,4]
[5,null,"T",null,null,null,5]
[6,null,"T",null,null,null,6]
[7,null,"T",null,null,null,7]
[8,null,"T",null,null,null,8]
[9,null,"T",null,null,null,9]
[10,null,"T",null,null,null,10]
[11,null,"T",null,null,null,11]
[12,null,"T",null,null,null,12]
[13,null,"T",null,null,null,13]
[14,null,"T",null,null,null,14]
[15,null,"T",null,null,null,15]
[16,null,"T",null,null,null,16]
[]
[null,null,"Copier/coller selon LISTE ENGAGES en fonction des équipes confirmées APRES les qualifications"]
[null,null,"ATTENTION : Respecter l'ordre des têtes de séries en fonction des points et classement de la LISTE ENGAGES"]
[null,null,"Ex: Si Sur LISTE ENGAGES, l'équipe 9 absente, la numéro 10 devient la numéro 9 dans EMARG"]
[null,null,"EX: Si toutes les equipes du tableau principal sont confirmées, les équipes issues qualifications sont replacées en fonction de leurs points, en bas de tableau"]

{"sheet":"PLANNING PS 16","index":7,"n_rows":39,"n_cols":19,"rows_kept":39,"cut":false,"hidden":false,"merged":[[3,2,3,3],[8,2,8,3],[1,7,4,15],[1,16,7,17],[5,7,5,9],[5,10,5,13],[5,14,5,15],[7,7,7,15],[6,7,6,15]]}
[]
[null,null,null,null,null,null,null,{"$f":"IF('LISTE ENGAGES'!R3=\"\",'LISTE ENGAGES'!Q3,'LISTE ENGAGES'!R3)","v":"APPELATION TOURNOI"},null,null,null,null,null,null,null,null,{"$f":"IF('LISTE ENGAGES'!$R$10<>\"\",'LISTE ENGAGES'!$R$10,'LISTE ENGAGES'!$Q$10)","v":"ORGANISATEUR"}]
[]
[null,"J2","HEURE DEBUT",null,"09:00:00"]
[null,null,"DUREE MATCH",null,"00:50:00"]
[null,null,null,null,null,null,null,{"$f":"IF('LISTE ENGAGES'!R4=\"\",'LISTE ENGAGES'!Q4,'LISTE ENGAGES'!R4)","v":"LIEU"},null,null,{"$f":"IF('LISTE ENGAGES'!R8=\"\",'LISTE ENGAGES'!Q8,'LISTE ENGAGES'!R8)","v":"DATE FIN"},null,null,null,{"$f":"IF('LISTE ENGAGES'!R9=\"\",'LISTE ENGAGES'!Q9,'LISTE ENGAGES'!R9)","v":"GENRE"}]
[null,null,null,null,null,null,null,{"$f":"IF('LISTE ENGAGES'!R5=\"\",'LISTE ENGAGES'!Q5,'LISTE ENGAGES'!R5)","v":"TYPE"}]
[null,null,null,null,null,null,null,"PLANNING DES RENCONTRES"]
[null,"J3","HEURE DEBUT",null,"09:00:00"]
[null,null,"DUREE MATCH",null,"01:00:00"]
[]
[]
[]
[]
[]
[null,null,null,null,"MATCH","n°","TER.","E1","./.","E2","ARB","MATCH","n°","TER.","E1","./.","E2","ARB","2*21, SD 15"]
[null,null,"JOUR 2",{"$f":"E4","v":"09:00:00"},"AM1",1,null,{"$f":"'TAB 16 PS PRINC'!C13","v":"T / 1"},null,{"$f":"'TAB 16 PS PRINC'!C16","v":"T / 16"},null,"CM1",2,null,{"$f":"'TAB 16 PS PRINC'!C27","v":"T / 3"},null,{"$f":"'TAB 16 PS PRINC'!C30","v":"T / 14"},null,"2*21, SD 15"]
[null,null,null,{"$f":"D17+$E$5","v":"09:50:00"},"BM1",3,null,{"$f":"'TAB 16 PS PRINC'!C20","v":"T / 2"},null,{"$f":"'TAB 16 PS PRINC'!C23","v":"T / 15"},null,"DM1",4,null,{"$f":"'TAB 16 PS PRINC'!C34","v":"T / 4"},null,{"$f":"'TAB 16 PS PRINC'!C37","v":"T / 13"},null,"2*21, SD 15"]
[null,null,null,{"$f":"D18+$E$5","v":"10:40:00"},"AM2",5,null,{"$f":"'TAB 16 PS PRINC'!C14","v":"T / 8"},null,{"$f":"'TAB 16 PS PRINC'!C15","v":"T / 9"},null,"CM2",6,null,{"$f":"'TAB 16 PS PRINC'!C28","v":"T / 6"},null,{"$f":"'TAB 16 PS PRINC'!C29","v":"T / 11"},null,"2*21, SD 15"]
[null,null,null,"11:30:00","BM2",7,null,{"$f":"'TAB 16 PS PRINC'!C21","v":"T / 7"},null,{"$f":"'TAB 16 PS PRINC'!C22","v":"T / 10"},null,"DM2",8,null,{"$f":"'TAB 16 PS PRINC'!C35","v":"T / 5"},null,{"$f":"'TAB 16 PS PRINC'!C36","v":"T /12"},null,"2*21, SD 15"]
[null,null,null,"12:20:00","AM3",9,null,{"$f":"'TAB 16 PS PRINC'!C14","v":"T / 8"},null,{"$f":"'TAB 16 PS PRINC'!C16","v":"T / 16"},null,"CM3",10,null,{"$f":"'TAB 16 PS PRINC'!C28","v":"T / 6"},null,{"$f":"'TAB 16 PS PRINC'!C30","v":"T / 14"},null,"2*21, SD 15"]
[null,null,null,"13:10:00","BM3",11,null,{"$f":"'TAB 16 PS PRINC'!C21","v":"T / 7"},null,{"$f":"'TAB 16 PS PRINC'!C23","v":"T / 15"},null,"DM3",12,null,{"$f":"'TAB 16 PS PRINC'!C35","v":"T / 5"},null,{"$f":"'TAB 16 PS PRINC'!C37","v":"T / 13"},null,"2*21, SD 15"]
[null,null,null,"14:00:00","AM4",13,null,{"$f":"'TAB 16 PS PRINC'!C13","v":"T / 1"},null,{"$f":"'TAB 16 PS PRINC'!C15","v":"T / 9"},null,"CM4",14,null,{"$f":"'TAB 16 PS PRINC'!C27","v":"T / 3"},null,{"$f":"'TAB 16 PS PRINC'!C29","v":"T / 11"},null,"2*21, SD 15"]
[null,null,null,"14:50:00","BM4",15,null,{"$f":"'TAB 16 PS PRINC'!C20","v":"T / 2"},null,{"$f":"'TAB 16 PS PRINC'!C22","v":"T / 10"},null,"DM4",16,null,{"$f":"'TAB 16 PS PRINC'!C34","v":"T / 4"},null,{"$f":"'TAB 16 PS PRINC'!C36","v":"T /12"},null,"2*21, SD 15"]
[null,null,null,"15:40:00","AM5",17,null,{"$f":"'TAB 16 PS PRINC'!C15","v":"T / 9"},null,{"$f":"'TAB 16 PS PRINC'!C16","v":"T / 16"},null,"CM5",18,null,{"$f":"'TAB 16 PS PRINC'!C29","v":"T / 11"},null,{"$f":"'TAB 16 PS PRINC'!C30","v":"T / 14"},null,"2*21, SD 15"]
[null,null,null,"16:30:00","BM5",19,null,{"$f":"'TAB 16 PS PRINC'!C22","v":"T / 10"},null,{"$f":"'TAB 16 PS PRINC'!C23","v":"T / 15"},null,"DM5",20,null,{"$f":"'TAB 16 PS PRINC'!C36","v":"T /12"},null,{"$f":"'TAB 16 PS PRINC'!C37","v":"T / 13"},null,"2*21, SD 15"]
[null,null,null,"17:20:00","AM6",21,null,{"$f":"'TAB 16 PS PRINC'!C13","v":"T / 1"},null,{"$f":"'TAB 16 PS PRINC'!C14","v":"T / 8"},null,"CM6",22,null,{"$f":"'TAB 16 PS PRINC'!C27","v":"T / 3"},null,{"$f":"'TAB 16 PS PRINC'!C28","v":"T / 6"},null,"2*21, SD 15"]
[null,null,null,"18:10:00","BM6",23,null,{"$f":"'TAB 16 PS PRINC'!C20","v":"T / 2"},null,{"$f":"'TAB 16 PS PRINC'!C21","v":"T / 7"},null,"DM6",24,null,{"$f":"'TAB 16 PS PRINC'!C34","v":"T / 4"},null,{"$f":"'TAB 16 PS PRINC'!C35","v":"T / 5"},null,"2*21, SD 15"]
[null,null,null,"19:00:00","FIN"]
[]
[null,null,null,null,"MATCH",null,"TER.","E1","./.","E2","ARB","MATCH",null,"TER.","E1","./.","E2","ARB","2*21, SD 15"]
[null,null,"JOUR 3",{"$f":"E9","v":"09:00:00"},"1/4 M1",29,null,{"$f":"'TAB 16 PS PRINC'!N12","v":"A1"},null,{"$f":"'TAB 16 PS PRINC'!N16","v":""},null,"1/4 M2",30,null,{"$f":"'TAB 16 PS PRINC'!N20","v":""},null,{"$f":"'TAB 16 PS PRINC'!N24","v":"D1"},null,"2*21, SD 15"]
[null,null,null,{"$f":"D32+$E$10","v":"10:00:00"},"1/4 M3",31,null,{"$f":"'TAB 16 PS PRINC'!N27","v":"C1"},null,{"$f":"'TAB 16 PS PRINC'!N31","v":""},null,"1/4 M4",32,null,{"$f":"'TAB 16 PS PRINC'!N39","v":"B1"},null,{"$f":"'TAB 16 PS PRINC'!N35","v":""},null,"2*21, SD 15"]
[null,null,null,{"$f":"D33+$E$10","v":"11:00:00"},"DEMI",33,null,{"$f":"'TAB 16 PS PRINC'!P14","v":""},null,{"$f":"'TAB 16 PS PRINC'!P23","v":""},null,null,null,null,null,null,null,null,"2*21, SD 15"]
[null,null,null,"12:00:00","DEMI",34,null,{"$f":"'TAB 16 PS PRINC'!P29","v":""},null,{"$f":"'TAB 16 PS PRINC'!P37","v":""},null,null,null,null,null,null,null,null,"2*21, SD 15"]
[null,null,null,"13:00:00"]
[null,null,null,"14:00:00","PETITE FINALE",35,null,{"$f":"'TAB 16 PS PRINC'!R40","v":""},null,{"$f":"'TAB 16 PS PRINC'!R45","v":""},null,null,null,null,null,null,null,null,"2*21, SD 15"]
[null,null,null,"15:00:00","FINALE",36,null,{"$f":"'TAB 16 PS PRINC'!R16","v":0},null,{"$f":"'TAB 16 PS PRINC'!R35","v":0},null,null,null,null,null,null,null,null,"2*21, SD 15"]
[null,null,null,"16:00:00","PODIUM"]

{"sheet":"SCORE PRIN","index":8,"n_rows":43,"n_cols":36,"rows_kept":43,"cut":false,"hidden":false,"merged":[]}
[null,null,null,null,"TABLEAU DE SAISIE DE RESULTATS"]
[]
["DEBUT J1","09:00:00",null,null,"Saisir le résultats des setas dans les cases bordurées et colorées uniquement"]
["TEMPS","00:50:00"]
["DEBUT J2","09:00:00"]
[]
[null,null,"PHASE","JOUR","N° MATCH","HEURE","TER","EQ1",null,"EQ2","SCORE EQ1",null,"SCORE EQ2","SET 1 EQ1","SET 1 EQ2","SET 2 EQ1","SET 2 EQ2","SET 3 EQ1","SET 3 EQ2","POS 1","POS 2",null,null,null,"A","PTS","S+","S-","P+","P-","CS","CP","CL.I","RG",null,"CLA"]
[null,null,"A",1,1,{"$f":"B3","v":"09:00:00"},1,{"$f":"'TAB 16 PS PRINC'!C13","v":"T / 1"},"/",{"$f":"'TAB 16 PS PRINC'!C16","v":"T / 16"},{"$f":"SUM(IF(N8>O8,1,0),IF(P8>Q8,1,0),IF(R8>S8,1,0))","v":0},"/",{"$f":"SUM(IF(O8>N8,1,0),IF(Q8>P8,1,0),IF(S8>R8,1,0))","v":0},null,null,null,null,null,null,{"$f":"IF(K8=M8,\"\",IF(K8>M8,H8,J8))","v":""},{"$f":"IF(K8=M8,\"\",IF(K8<M8,H8,J8))","v":""},null,null,null,{"$f":"'TAB 16 PS PRINC'!C13","v":"T / 1"},{"$f":"COUNTIF(PLACE1,Y8)*2+COUNTIF(PLACE2,Y8)","v":0},{"$f":"SUMIF(LISTEE1,Y8,(SCEQ1))+SUMIF(LISTEE2,Y8,(SCEQ2))","v":0},{"$f":"SUMIF(LISTEE1,Y8,(SCEQ2))+SUMIF(LISTEE2,Y8,(SCEQ1))","v":0},{"$f":"(SUMPRODUCT((LISTEE1=Y8)*((S1EQ1)+(S2EQ1)+(S3EQ1))))+(SUMPRODUCT((LISTEE2=Y8)*((S1EQ2)+(S2EQ2)+(S3EQ3))))","v":0},{"$f":"(SUMPRODUCT((LISTEE2=Y8)*((S1EQ1)+(S2EQ1)+(S3EQ1))))+(SUMPRODUCT((LISTEE1=Y8)*((S1EQ2)+(S2EQ2)+(S3EQ3))))","v":0},{"$f":"IFERROR(AA8/AB8,0)","v":0},{"$f":"IFERROR(AC8/AD8,0)","v":0},{"$f":"Z8+AE8/100+AF8/100","v":0},{"$f":"IF(Z8=0,\"\",RANK(AG8,$AG$8:$AG$11))","v":""},1,{"$f":"IF(Z8=0,\"\",IF($AH$8=AI8,$Y$8,IF($AH$9=AI8,$Y$9,IF($AH$10=AI8,$Y$10,IF($AH$11=AI8,$Y$11)))))","v":""}]
[null,null,"B",1,2,{"$f":"F8+$B$4","v":"09:50:00"},1,{"$f":"'TAB 16 PS PRINC'!C20","v":"T / 2"},"/",{"$f":"'TAB 16 PS PRINC'!C23","v":"T / 15"},{"$f":"SUM(IF(N9>O9,1,0),IF(P9>Q9,1,0),IF(R9>S9,1,0))","v":0},"/",{"$f":"SUM(IF(O9>N9,1,0),IF(Q9>P9,1,0),IF(S9>R9,1,0))","v":0},null,null,null,null,null,null,{"$f":"IF(K9=M9,\"\",IF(K9>M9,H9,J9))","v":""},{"$f":"IF(K9=M9,\"\",IF(K9<M9,H9,J9))","v":""},null,null,null,{"$f":"'TAB 16 PS PRINC'!C14","v":"T / 8"},{"$f":"COUNTIF(PLACE1,Y9)*2+COUNTIF(PLACE2,Y9)","v":0},{"$f":"SUMIF(LISTEE1,Y9,(SCEQ1))+SUMIF(LISTEE2,Y9,(SCEQ2))","v":0},{"$f":"SUMIF(LISTEE1,Y9,(SCEQ2))+SUMIF(LISTEE2,Y9,(SCEQ1))","v":0},{"$f":"(SUMPRODUCT((LISTEE1=Y9)*((S1EQ1)+(S2EQ1)+(S3EQ1))))+(SUMPRODUCT((LISTEE2=Y9)*((S1EQ2)+(S2EQ2)+(S3EQ3))))","v":0},{"$f":"(SUMPRODUCT((LISTEE2=Y9)*((S1EQ1)+(S2EQ1)+(S3EQ1))))+(SUMPRODUCT((LISTEE1=Y9)*((S1EQ2)+(S2EQ2)+(S3EQ3))))","v":0},{"$f":"IFERROR(AA9/AB9,0)","v":0},{"$f":"IFERROR(AC9/AD9,0)","v":0},{"$f":"Z9+AE9/100+AF9/100","v":0},{"$f":"IF(Z9=0,\"\",RANK(AG9,$AG$8:$AG$11))","v":""},2,{"$f":"IF(Z9=0,\"\",IF($AH$8=AI9,$Y$8,IF($AH$9=AI9,$Y$9,IF($AH$10=AI9,$Y$10,IF($AH$11=AI9,$Y$11)))))","v":""}]
[null,null,"C",1,3,{"$f":"B3","v":"09:00:00"},2,{"$f":"'TAB 16 PS PRINC'!C27","v":"T / 3"},"/",{"$f":"'TAB 16 PS PRINC'!C30","v":"T / 14"},0,"/",0,null,null,null,null,null,null,"","",null,null,null,{"$f":"'TAB 16 PS PRINC'!C15","v":"T / 9"},{"$f":"COUNTIF(PLACE1,Y10)*2+COUNTIF(PLACE2,Y10)","v":0},{"$f":"SUMIF(LISTEE1,Y10,(SCEQ1))+SUMIF(LISTEE2,Y10,(SCEQ2))","v":0},{"$f":"SUMIF(LISTEE1,Y10,SCEQ2)+SUMIF(LISTEE2,Y10,SCEQ1)","v":0},{"$f":"(SUMPRODUCT((LISTEE1=Y10)*((S1EQ1)+(S2EQ1)+(S3EQ1))))+(SUMPRODUCT((LISTEE2=Y10)*((S1EQ2)+(S2EQ2)+(S3EQ3))))","v":0},{"$f":"(SUMPRODUCT((LISTEE2=Y10)*((S1EQ1)+(S2EQ1)+(S3EQ1))))+(SUMPRODUCT((LISTEE1=Y10)*((S1EQ2)+(S2EQ2)+(S3EQ3))))","v":0},0,0,0,{"$f":"IF(Z10=0,\"\",RANK(AG10,$AG$8:$AG$11))","v":""},3,{"$f":"IF(Z10=0,\"\",IF($AH$8=AI10,$Y$8,IF($AH$9=AI10,$Y$9,IF($AH$10=AI10,$Y$10,IF($AH$11=AI10,$Y$11)))))","v":""}]
[null,null,"D",1,4,{"$f":"F10+$B$4","v":"09:50:00"},2,{"$f":"'TAB 16 PS PRINC'!C34","v":"T / 4"},"/",{"$f":"'TAB 16 PS PRINC'!C37","v":"T / 13"},0,"/",0,null,null,null,null,null,null,"","",null,null,null,{"$f":"'TAB 16 PS PRINC'!C16","v":"T / 16"},{"$f":"COUNTIF(PLACE1,Y11)*2+COUNTIF(PLACE2,Y11)","v":0},{"$f":"SUMIF(LISTEE1,Y11,(SCEQ1))+SUMIF(LISTEE2,Y11,(SCEQ2))","v":0},{"$f":"SUMIF(LISTEE1,Y11,SCEQ2)+SUMIF(LISTEE2,Y11,SCEQ1)","v":0},{"$f":"(SUMPRODUCT((LISTEE1=Y11)*((S1EQ1)+(S2EQ1)+(S3EQ1))))+(SUMPRODUCT((LISTEE2=Y11)*((S1EQ2)+(S2EQ2)+(S3EQ3))))","v":0},{"$f":"(SUMPRODUCT((LISTEE2=Y11)*((S1EQ1)+(S2EQ1)+(S3EQ1))))+(SUMPRODUCT((LISTEE1=Y11)*((S1EQ2)+(S2EQ2)+(S3EQ3))))","v":0},0,0,0,{"$f":"IF(Z11=0,\"\",RANK(AG11,$AG$8:$AG$11))","v":""},4,{"$f":"IF(Z11=0,\"\",IF($AH$8=AI11,$Y$8,IF($AH$9=AI11,$Y$9,IF($AH$10=AI11,$Y$10,IF($AH$11=AI11,$Y$11)))))","v":""}]
[null,null,"A",1,5,{"$f":"F9+B4","v":"10:40:00"},1,{"$f":"'TAB 16 PS PRINC'!C14","v":"T / 8"},"/",{"$f":"'TAB 16 PS PRINC'!C15","v":"T / 9"},0,"/",0,null,null,null,null,null,null,"","",null,null,null,"B"]
[null,null,"B",1,6,{"$f":"F12+B4","v":"11:30:00"},1,{"$f":"'TAB 16 PS PRINC'!C21","v":"T / 7"},"/",{"$f":"'TAB 16 PS PRINC'!C22","v":"T / 10"},0,"/",0,null,null,null,null,null,null,"","",null,null,null,{"$f":"'TAB 16 PS PRINC'!C20","v":"T / 2"},{"$f":"COUNTIF(PLACE1,Y13)*2+COUNTIF(PLACE2,Y13)","v":0},{"$f":"SUMIF(LISTEE1,Y13,(SCEQ1))+SUMIF(LISTEE2,Y13,(SCEQ2))","v":0},{"$f":"SUMIF(LISTEE1,Y13,SCEQ2)+SUMIF(LISTEE2,Y13,SCEQ1)","v":0},{"$f":"(SUMPRODUCT((LISTEE1=Y13)*((S1EQ1)+(S2EQ1)+(S3EQ1))))+(SUMPRODUCT((LISTEE2=Y13)*((S1EQ2)+(S2EQ2)+(S3EQ3))))","v":0},{"$f":"(SUMPRODUCT((LISTEE2=Y13)*((S1EQ1)+(S2EQ1)+(S3EQ1))))+(SUMPRODUCT((LISTEE1=Y13)*((S1EQ2)+(S2EQ2)+(S3EQ3))))","v":0},0,0,0,{"$f":"IF(Z13=0,\"\",RANK(AG13,$AG$13:$AG$16))","v":""},1,{"$f":"IF(Z13=0,\"\",IF($AH$13=AI13,$Y$13,IF($AH$14=AI13,$Y$14,IF($AH$15=AI13,$Y$15,IF($AH$16=AI13,$Y$16)))))","v":""}]
[null,null,"C",1,7,{"$f":"F11+$B$4","v":"10:40:00"},2,{"$f":"'TAB 16 PS PRINC'!C28","v":"T / 6"},"/",{"$f":"'TAB 16 PS PRINC'!C29","v":"T / 11"},{"$f":"SUM(IF(N14>O14,1,0),IF(P14>Q14,1,0),IF(R14>S14,1,0))","v":0},"/",0,null,null,null,null,null,null,{"$f":"IF(K14=M14,\"\",IF(K14>M14,H14,J14))","v":""},"",null,null,null,{"$f":"'TAB 16 PS PRINC'!C21","v":"T / 7"},{"$f":"COUNTIF(PLACE1,Y14)*2+COUNTIF(PLACE2,Y14)","v":0},{"$f":"SUMIF(LISTEE1,Y14,(SCEQ1))+SUMIF(LISTEE2,Y14,(SCEQ2))","v":0},{"$f":"SUMIF(LISTEE1,Y14,SCEQ2)+SUMIF(LISTEE2,Y14,SCEQ1)","v":0},{"$f":"(SUMPRODUCT((LISTEE1=Y14)*((S1EQ1)+(S2EQ1)+(S3EQ1))))+(SUMPRODUCT((LISTEE2=Y14)*((S1EQ2)+(S2EQ2)+(S3EQ3))))","v":0},{"$f":"(SUMPRODUCT((LISTEE2=Y14)*((S1EQ1)+(S2EQ1)+(S3EQ1))))+(SUMPRODUCT((LISTEE1=Y14)*((S1EQ2)+(S2EQ2)+(S3EQ3))))","v":0},0,0,0,{"$f":"IF(Z14=0,\"\",RANK(AG14,$AG$13:$AG$16))","v":""},2,{"$f":"IF(Z14=0,\"\",IF($AH$13=AI14,$Y$13,IF($AH$14=AI14,$Y$14,IF($AH$15=AI14,$Y$15,IF($AH$16=AI14,$Y$16)))))","v":""}]
[null,null,"D",1,8,{"$f":"F14+$B$4","v":"11:30:00"},2,{"$f":"'TAB 16 PS PRINC'!C35","v":"T / 5"},"/",{"$f":"'TAB 16 PS PRINC'!C36","v":"T /12"},0,"/",0,null,null,null,null,null,null,"","",null,null,null,{"$f":"'TAB 16 PS PRINC'!C22","v":"T / 10"},{"$f":"COUNTIF(PLACE1,Y15)*2+COUNTIF(PLACE2,Y15)","v":0},{"$f":"SUMIF(LISTEE1,Y15,(SCEQ1))+SUMIF(LISTEE2,Y15,(SCEQ2))","v":0},{"$f":"SUMIF(LISTEE1,Y15,SCEQ2)+SUMIF(LISTEE2,Y15,SCEQ1)","v":0},{"$f":"(SUMPRODUCT((LISTEE1=Y15)*((S1EQ1)+(S2EQ1)+(S3EQ1))))+(SUMPRODUCT((LISTEE2=Y15)*((S1EQ2)+(S2EQ2)+(S3EQ3))))","v":0},{"$f":"(SUMPRODUCT((LISTEE2=Y15)*((S1EQ1)+(S2EQ1)+(S3EQ1))))+(SUMPRODUCT((LISTEE1=Y15)*((S1EQ2)+(S2EQ2)+(S3EQ3))))","v":0},0,0,0,{"$f":"IF(Z15=0,\"\",RANK(AG15,$AG$13:$AG$16))","v":""},3,{"$f":"IF(Z15=0,\"\",IF($AH$13=AI15,$Y$13,IF($AH$14=AI15,$Y$14,IF($AH$15=AI15,$Y$15,IF($AH$16=AI15,$Y$16)))))","v":""}]
[null,null,"A",1,9,{"$f":"F13+$B$4","v":"12:20:00"},1,"T / 8","/",{"$f":"'TAB 16 PS PRINC'!C16","v":"T / 16"},0,"/",0,null,null,null,null,null,null,"","",null,null,null,{"$f":"'TAB 16 PS PRINC'!C23","v":"T / 15"},{"$f":"COUNTIF(PLACE1,Y16)*2+COUNTIF(PLACE2,Y16)","v":0},{"$f":"SUMIF(LISTEE1,Y16,(SCEQ1))+SUMIF(LISTEE2,Y16,(SCEQ2))","v":0},{"$f":"SUMIF(LISTEE1,Y16,SCEQ2)+SUMIF(LISTEE2,Y16,SCEQ1)","v":0},{"$f":"(SUMPRODUCT((LISTEE1=Y16)*((S1EQ1)+(S2EQ1)+(S3EQ1))))+(SUMPRODUCT((LISTEE2=Y16)*((S1EQ2)+(S2EQ2)+(S3EQ3))))","v":0},{"$f":"(SUMPRODUCT((LISTEE2=Y16)*((S1EQ1)+(S2EQ1)+(S3EQ1))))+(SUMPRODUCT((LISTEE1=Y16)*((S1EQ2)+(S2EQ2)+(S3EQ3))))","v":0},0,0,0,{"$f":"IF(Z16=0,\"\",RANK(AG16,$AG$13:$AG$16))","v":""},4,{"$f":"IF(Z16=0,\"\",IF($AH$13=AI16,$Y$13,IF($AH$14=AI16,$Y$14,IF($AH$15=AI16,$Y$15,IF($AH$16=AI16,$Y$16)))))","v":""}]
[null,null,"B",1,10,{"$f":"F16+$B$4","v":"13:10:00"},1,"T / 7","/",{"$f":"'TAB 16 PS PRINC'!C23","v":"T / 15"},0,"/",0,null,null,null,null,null,null,"","",null,null,null,"C"]
[null,null,"C",1,11,{"$f":"F15+$B$4","v":"12:20:00"},2,"T / 6","/",{"$f":"'TAB 16 PS PRINC'!C30","v":"T / 14"},0,"/",0,null,null,null,null,null,null,"","",null,null,null,{"$f":"'TAB 16 PS PRINC'!C27","v":"T / 3"},{"$f":"COUNTIF(PLACE1,Y18)*2+COUNTIF(PLACE2,Y18)","v":0},{"$f":"SUMIF(LISTEE1,Y18,(SCEQ1))+SUMIF(LISTEE2,Y18,(SCEQ2))","v":0},{"$f":"SUMIF(LISTEE1,Y18,SCEQ2)+SUMIF(LISTEE2,Y18,SCEQ1)","v":0},{"$f":"(SUMPRODUCT((LISTEE1=Y18)*((S1EQ1)+(S2EQ1)+(S3EQ1))))+(SUMPRODUCT((LISTEE2=Y18)*((S1EQ2)+(S2EQ2)+(S3EQ3))))","v":0},{"$f":"(SUMPRODUCT((LISTEE2=Y18)*((S1EQ1)+(S2EQ1)+(S3EQ1))))+(SUMPRODUCT((LISTEE1=Y18)*((S1EQ2)+(S2EQ2)+(S3EQ3))))","v":0},{"$f":"IFERROR(AA18/AB18,0)","v":0},0,{"$f":"Z18+AE18/100+AF18/100","v":0},{"$f":"IF(Z18=0,\"\",RANK(AG18,$AG$18:$AG$21))","v":""},1,{"$f":"IF(Z18=0,\"\",IF($AH$18=AI18,$Y$18,IF($AH$19=AI18,$Y$19,IF($AH$20=AI18,$Y$20,IF($AH$21=AI18,$Y$21)))))","v":""}]
[null,null,"D",1,12,{"$f":"F18+$B$4","v":"13:10:00"},2,"T / 5","/",{"$f":"'TAB 16 PS PRINC'!C37","v":"T / 13"},0,"/",0,null,null,null,null,null,null,"","",null,null,null,{"$f":"'TAB 16 PS PRINC'!C28","v":"T / 6"},{"$f":"COUNTIF(PLACE1,Y19)*2+COUNTIF(PLACE2,Y19)","v":0},{"$f":"SUMIF(LISTEE1,Y19,(SCEQ1))+SUMIF(LISTEE2,Y19,(SCEQ2))","v":0},{"$f":"SUMIF(LISTEE1,Y19,SCEQ2)+SUMIF(LISTEE2,Y19,SCEQ1)","v":0},{"$f":"(SUMPRODUCT((LISTEE1=Y19)*((S1EQ1)+(S2EQ1)+(S3EQ1))))+(SUMPRODUCT((LISTEE2=Y19)*((S1EQ2)+(S2EQ2)+(S3EQ3))))","v":0},{"$f":"(SUMPRODUCT((LISTEE2=Y19)*((S1EQ1)+(S2EQ1)+(S3EQ1))))+(SUMPRODUCT((LISTEE1=Y19)*((S1EQ2)+(S2EQ2)+(S3EQ3))))","v":0},0,0,{"$f":"Z19+AE19/100+AF19/100","v":0},{"$f":"IF(Z19=0,\"\",RANK(AG19,$AG$18:$AG$21))","v":""},2,{"$f":"IF(Z19=0,\"\",IF($AH$18=AI19,$Y$18,IF($AH$19=AI19,$Y$19,IF($AH$20=AI19,$Y$20,IF($AH$21=AI19,$Y$21)))))","v":""}]
[null,null,"A",1,13,{"$f":"F17+$B$4","v":"14:00:00"},1,"T / 1","/",{"$f":"'TAB 16 PS PRINC'!C15","v":"T / 9"},0,"/",0,null,null,null,null,null,null,"","",null,null,null,{"$f":"'TAB 16 PS PRINC'!C29","v":"T / 11"},{"$f":"COUNTIF(PLACE1,Y20)*2+COUNTIF(PLACE2,Y20)","v":0},{"$f":"SUMIF(LISTEE1,Y20,(SCEQ1))+SUMIF(LISTEE2,Y20,(SCEQ2))","v":0},{"$f":"SUMIF(LISTEE1,Y20,SCEQ2)+SUMIF(LISTEE2,Y20,SCEQ1)","v":0},{"$f":"(SUMPRODUCT((LISTEE1=Y20)*((S1EQ1)+(S2EQ1)+(S3EQ1))))+(SUMPRODUCT((LISTEE2=Y20)*((S1EQ2)+(S2EQ2)+(S3EQ3))))","v":0},{"$f":"(SUMPRODUCT((LISTEE2=Y20)*((S1EQ1)+(S2EQ1)+(S3EQ1))))+(SUMPRODUCT((LISTEE1=Y20)*((S1EQ2)+(S2EQ2)+(S3EQ3))))","v":0},0,0,0,"",3,{"$f":"IF(Z20=0,\"\",IF($AH$18=AI20,$Y$18,IF($AH$19=AI20,$Y$19,IF($AH$20=AI20,$Y$20,IF($AH$21=AI20,$Y$21)))))","v":""}]
[null,null,"B",1,14,{"$f":"F20+$B$4","v":"14:50:00"},1,"T / 2","/",{"$f":"'TAB 16 PS PRINC'!C22","v":"T / 10"},0,"/",0,null,null,null,null,null,null,"","",null,null,null,{"$f":"'TAB 16 PS PRINC'!C30","v":"T / 14"},{"$f":"COUNTIF(PLACE1,Y21)*2+COUNTIF(PLACE2,Y21)","v":0},{"$f":"SUMIF(LISTEE1,Y21,(SCEQ1))+SUMIF(LISTEE2,Y21,(SCEQ2))","v":0},{"$f":"SUMIF(LISTEE1,Y21,SCEQ2)+SUMIF(LISTEE2,Y21,SCEQ1)","v":0},{"$f":"(SUMPRODUCT((LISTEE1=Y21)*((S1EQ1)+(S2EQ1)+(S3EQ1))))+(SUMPRODUCT((LISTEE2=Y21)*((S1EQ2)+(S2EQ2)+(S3EQ3))))","v":0},{"$f":"(SUMPRODUCT((LISTEE2=Y21)*((S1EQ1)+(S2EQ1)+(S3EQ1))))+(SUMPRODUCT((LISTEE1=Y21)*((S1EQ2)+(S2EQ2)+(S3EQ3))))","v":0},0,0,{"$f":"Z21+AE21/100+AF21/100","v":0},"",4,{"$f":"IF(Z21=0,\"\",IF($AH$18=AI21,$Y$18,IF($AH$19=AI21,$Y$19,IF($AH$20=AI21,$Y$20,IF($AH$21=AI21,$Y$21)))))","v":""}]
[null,null,"C",1,15,{"$f":"F19+$B$4","v":"14:00:00"},2,"T / 3","/",{"$f":"'TAB 16 PS PRINC'!C29","v":"T / 11"},0,"/",0,null,null,null,null,null,null,"","",null,null,null,"D"]
[null,null,"D",1,16,{"$f":"F22+$B$4","v":"14:50:00"},2,"T / 4","/",{"$f":"'TAB 16 PS PRINC'!C36","v":"T /12"},0,"/",0,null,null,null,null,null,null,"","",null,null,null,{"$f":"'TAB 16 PS PRINC'!C34","v":"T / 4"},{"$f":"COUNTIF(PLACE1,Y23)*2+COUNTIF(PLACE2,Y23)","v":0},{"$f":"SUMIF(LISTEE1,Y23,(SCEQ1))+SUMIF(LISTEE2,Y23,(SCEQ2))","v":0},{"$f":"SUMIF(LISTEE1,Y23,SCEQ2)+SUMIF(LISTEE2,Y23,SCEQ1)","v":0},{"$f":"(SUMPRODUCT((LISTEE1=Y23)*((S1EQ1)+(S2EQ1)+(S3EQ1))))+(SUMPRODUCT((LISTEE2=Y23)*((S1EQ2)+(S2EQ2)+(S3EQ3))))","v":0},{"$f":"(SUMPRODUCT((LISTEE2=Y23)*((S1EQ1)+(S2EQ1)+(S3EQ1))))+(SUMPRODUCT((LISTEE1=Y23)*((S1EQ2)+(S2EQ2)+(S3EQ3))))","v":0},0,0,0,{"$f":"IF(Z23=0,\"\",RANK(AG23,$AG$23:$AG$26))","v":""},1,{"$f":"IF(Z23=0,\"\",IF($AH$23=AI23,$Y$23,IF($AH$24=AI23,$Y$24,IF($AH$25=AI23,$Y$25,IF($AH$26=AI23,$Y$26)))))","v":""}]
[null,null,"A",1,17,{"$f":"F21+$B$4","v":"15:40:00"},1,{"$f":"'TAB 16 PS PRINC'!C15","v":"T / 9"},"/",{"$f":"'TAB 16 PS PRINC'!C16","v":"T / 16"},0,"/",0,null,null,null,null,null,null,"","",null,null,null,{"$f":"'TAB 16 PS PRINC'!C35","v":"T / 5"},{"$f":"COUNTIF(PLACE1,Y24)*2+COUNTIF(PLACE2,Y24)","v":0},{"$f":"SUMIF(LISTEE1,Y24,(SCEQ1))+SUMIF(LISTEE2,Y24,(SCEQ2))","v":0},{"$f":"SUMIF(LISTEE1,Y24,SCEQ2)+SUMIF(LISTEE2,Y24,SCEQ1)","v":0},{"$f":"(SUMPRODUCT((LISTEE1=Y24)*((S1EQ1)+(S2EQ1)+(S3EQ1))))+(SUMPRODUCT((LISTEE2=Y24)*((S1EQ2)+(S2EQ2)+(S3EQ3))))","v":0},{"$f":"(SUMPRODUCT((LISTEE2=Y24)*((S1EQ1)+(S2EQ1)+(S3EQ1))))+(SUMPRODUCT((LISTEE1=Y24)*((S1EQ2)+(S2EQ2)+(S3EQ3))))","v":0},0,0,0,{"$f":"IF(Z24=0,\"\",RANK(AG24,$AG$23:$AG$26))","v":""},2,{"$f":"IF(Z24=0,\"\",IF($AH$23=AI24,$Y$23,IF($AH$24=AI24,$Y$24,IF($AH$25=AI24,$Y$25,IF($AH$26=AI24,$Y$26)))))","v":""}]
[null,null,"B",1,18,{"$f":"F24+$B$4","v":"16:30:00"},1,{"$f":"'TAB 16 PS PRINC'!C22","v":"T / 10"},"/",{"$f":"'TAB 16 PS PRINC'!C23","v":"T / 15"},0,"/",0,null,null,null,null,null,null,"","",null,null,null,{"$f":"'TAB 16 PS PRINC'!C36","v":"T /12"},{"$f":"COUNTIF(PLACE1,Y25)*2+COUNTIF(PLACE2,Y25)","v":0},{"$f":"SUMIF(LISTEE1,Y25,(SCEQ1))+SUMIF(LISTEE2,Y25,(SCEQ2))","v":0},{"$f":"SUMIF(LISTEE1,Y25,SCEQ2)+SUMIF(LISTEE2,Y25,SCEQ1)","v":0},{"$f":"(SUMPRODUCT((LISTEE1=Y25)*((S1EQ1)+(S2EQ1)+(S3EQ1))))+(SUMPRODUCT((LISTEE2=Y25)*((S1EQ2)+(S2EQ2)+(S3EQ3))))","v":0},{"$f":"(SUMPRODUCT((LISTEE2=Y25)*((S1EQ1)+(S2EQ1)+(S3EQ1))))+(SUMPRODUCT((LISTEE1=Y25)*((S1EQ2)+(S2EQ2)+(S3EQ3))))","v":0},0,0,0,"",3,""]
[null,null,"C",1,19,{"$f":"F23+$B$4","v":"15:40:00"},2,{"$f":"'TAB 16 PS PRINC'!C29","v":"T / 11"},"/",{"$f":"'TAB 16 PS PRINC'!C30","v":"T / 14"},0,"/",0,null,null,null,null,null,null,"","",null,null,null,{"$f":"'TAB 16 PS PRINC'!C37","v":"T / 13"},{"$f":"COUNTIF(PLACE1,Y26)*2+COUNTIF(PLACE2,Y26)","v":0},{"$f":"SUMIF(LISTEE1,Y26,(SCEQ1))+SUMIF(LISTEE2,Y26,(SCEQ2))","v":0},{"$f":"SUMIF(LISTEE1,Y26,SCEQ2)+SUMIF(LISTEE2,Y26,SCEQ1)","v":0},{"$f":"(SUMPRODUCT((LISTEE1=Y26)*((S1EQ1)+(S2EQ1)+(S3EQ1))))+(SUMPRODUCT((LISTEE2=Y26)*((S1EQ2)+(S2EQ2)+(S3EQ3))))","v":0},{"$f":"(SUMPRODUCT((LISTEE2=Y26)*((S1EQ1)+(S2EQ1)+(S3EQ1))))+(SUMPRODUCT((LISTEE1=Y26)*((S1EQ2)+(S2EQ2)+(S3EQ3))))","v":0},0,0,0,"",4,{"$f":"IF(Z26=0,\"\",IF($AH$23=AI26,$Y$23,IF($AH$24=AI26,$Y$24,IF($AH$25=AI26,$Y$25,IF($AH$26=AI26,$Y$26)))))","v":""}]
[null,null,"D",1,20,{"$f":"F26+$B$4","v":"16:30:00"},2,{"$f":"'TAB 16 PS PRINC'!C36","v":"T /12"},"/",{"$f":"'TAB 16 PS PRINC'!C37","v":"T / 13"},0,"/",0,null,null,null,null,null,null,{"$f":"IF(K27=M27,\"\",IF(K27>M27,H27,J27))","v":""},""]
[null,null,"A",1,21,{"$f":"F25+$B$4","v":"17:20:00"},1,{"$f":"'TAB 16 PS Qualif'!C13","v":"T / 1"},"/",{"$f":"'TAB 16 PS PRINC'!C14","v":"T / 8"},0,"/",0,null,null,null,null,null,null,{"$f":"IF(K28=M28,\"\",IF(K28>M28,H28,J28))","v":""},""]
[null,null,"B",1,22,{"$f":"F28+$B$4","v":"18:10:00"},1,{"$f":"'TAB 16 PS Qualif'!C20","v":"T / 2"},"/",{"$f":"'TAB 16 PS PRINC'!C21","v":"T / 7"},0,"/",0,null,null,null,null,null,null,"",""]
[null,null,"C",1,23,{"$f":"F27+$B$4","v":"17:20:00"},2,{"$f":"'TAB 16 PS Qualif'!C27","v":"T / 3"},"/",{"$f":"'TAB 16 PS PRINC'!C28","v":"T / 6"},0,"/",0,null,null,null,null,null,null,"",""]
[null,null,"D",1,24,{"$f":"F30+$B$4","v":"18:10:00"},2,{"$f":"'TAB 16 PS Qualif'!C34","v":"T / 4"},"/",{"$f":"'TAB 16 PS PRINC'!C35","v":"T / 5"},0,"/",0,null,null,null,null,null,null,"",""]
[null,null,"BARR",1,25,{"$f":"F30+$B$4","v":"18:10:00"},1,{"$f":"AJ19","v":""},"/",{"$f":"AJ25","v":""},0,"/",0,null,null,null,null,null,null,{"$f":"IF(K32=M32,\"\",IF(K32>M32,H32,J32))","v":""},""]
[null,null,"BARR",1,26,{"$f":"F31+$B$4","v":"19:00:00"},2,{"$f":"AJ14","v":""},"/",{"$f":"AJ10","v":""},0,"/",0,null,null,null,null,null,null,{"$f":"IF(K33=M33,\"\",IF(K33>M33,H33,J33))","v":""},""]
[null,null,"BARR",1,27,"19:00:00",1,{"$f":"AJ9","v":""},"/",{"$f":"AJ15","v":""},0,"/",0,null,null,null,null,null,null,"",""]
[null,null,"BARR",1,28,"19:50:00",2,{"$f":"AJ24","v":""},"/",{"$f":"AJ20","v":""},0,"/",0,null,null,null,null,null,null,"",""]
[null,null,"1/4",1,29,{"$f":"B5","v":"09:00:00"},1,{"$f":"AJ8","v":""},"/",{"$f":"IF(K32=M32,AJ19,T32)","v":""},0,"/",0,null,null,null,null,null,null,"",""]
[null,null,"1/4",1,30,{"$f":"F36","v":"09:00:00"},2,{"$f":"AJ23","v":""},"/",{"$f":"IF(K33=M33,AJ14,T33)","v":""},0,"/",0,null,null,null,null,null,null,"",""]
[null,null,"1/4",1,31,"09:50:00",1,{"$f":"AJ18","v":""},"/",{"$f":"IF(K34=M34,AJ9,T34)","v":""},0,"/",0,null,null,null,null,null,null,"",""]
[null,null,"1/4",1,32,"09:50:00",2,{"$f":"AJ13","v":""},"/",{"$f":"IF(K35=M35,AJ24,T35)","v":""},0,"/",0,null,null,null,null,null,null,"",""]
[null,null,"1/2",1,33,"10:40:00",1,{"$f":"T36","v":""},"/",{"$f":"T37","v":""},0,"/",0,null,null,null,null,null,null,"",""]
[null,null,"1/2",1,34,{"$f":"F40+$B$4","v":"11:30:00"},1,{"$f":"T39","v":""},"/",{"$f":"T38","v":""},0,"/",0,null,null,null,null,null,null,"",""]
[null,null,"3-4",1,35,"14:00:00",1,{"$f":"U40","v":""},"/",{"$f":"U41","v":""},0,"/",0,null,null,null,null,null,null,"",""]
[null,null,"F",1,36,{"$f":"F42+$B$4","v":"14:50:00"},1,{"$f":"T40","v":""},"/",{"$f":"T41","v":""},0,"/",0,null,null,null,null,null,null,"",""]

{"sheet":"TAB 16 PS PRINC","index":9,"n_rows":45,"n_cols":19,"rows_kept":45,"cut":false,"hidden":false,"merged":[[9,4,9,5],[0,5,3,12],[4,5,4,7],[4,8,4,9],[4,10,4,12],[5,5,5,14],[6,5,6,14],[0,13,4,14]]}
[null,null,null,null,null,{"$f":"IF('LISTE ENGAGES'!R3=\"\",'LISTE ENGAGES'!Q3,'LISTE ENGAGES'!R3)","v":"APPELATION TOURNOI"},null,null,null,null,null,null,null,{"$f":"IF('LISTE ENGAGES'!$R$10<>\"\",'LISTE ENGAGES'!$R$10,'LISTE ENGAGES'!$Q$10)","v":"ORGANISATEUR"}]
[]
[]
[]
[null,null,null,null,null,{"$f":"IF('LISTE ENGAGES'!R4=\"\",'LISTE ENGAGES'!Q4,'LISTE ENGAGES'!R4)","v":"LIEU"},null,null,{"$f":"IF('LISTE ENGAGES'!R8=\"\",'LISTE ENGAGES'!Q8,'LISTE ENGAGES'!R8)","v":"DATE FIN"},null,{"$f":"IF('LISTE ENGAGES'!R9=\"\",'LISTE ENGAGES'!Q9,'LISTE ENGAGES'!R9)","v":"GENRE"}]
[null,null,null,null,null,{"$f":"IF('LISTE ENGAGES'!R5=\"\",'LISTE ENGAGES'!Q5,'LISTE ENGAGES'!R5)","v":"TYPE"}]
[null,null,null,null,null,"TABLEAU PRINCIPAL"]
[]
[]
[null,null,"POULES",null,"RESULTATS",null,null,null,null,"CLASSEMENT POULE",null,"BARRAGES",null,"1/4 FINALES",null,"1/2 FINALES",null,"FINALES"]
[]
[null,null,null,"TS1-TS16","(1)",{"$f":"IF('SCORE PRIN'!K8='SCORE PRIN'!M8,\"\",CONCATENATE('SCORE PRIN'!K8,\" / \",'SCORE PRIN'!M8,\" (\",'SCORE PRIN'!N8,\"-\",'SCORE PRIN'!O8,\")(\",'SCORE PRIN'!P8,\"-\",'SCORE PRIN'!Q8,\")(\",'SCORE PRIN'!R8,\"-\",'SCORE PRIN'!S8,\")\"))","v":""},null,null,null,null,null,null,null,{"$f":"IF(J13=\"\",\"A1\",J13)","v":"A1"}]
[null,"T1",{"$f":"CONCATENATE('EMARG M Tableau PRIN'!C9,\" / \",'EMARG M Tableau PRIN'!G9)","v":"T / 1"},"TS8-TS9","(5)",{"$f":"IF('SCORE PRIN'!K12='SCORE PRIN'!M12,\"\",CONCATENATE('SCORE PRIN'!K12,\" / \",'SCORE PRIN'!M12,\" (\",'SCORE PRIN'!N12,\"-\",'SCORE PRIN'!O12,\")(\",'SCORE PRIN'!P12,\"-\",'SCORE PRIN'!Q12,\")(\",'SCORE PRIN'!R12,\"-\",'SCORE PRIN'!S12,\")\"))","v":""},null,null,1,{"$f":"'SCORE PRIN'!AJ8","v":""}]
["A","T8",{"$f":"CONCATENATE('EMARG M Tableau PRIN'!C16,\" / \",'EMARG M Tableau PRIN'!G16)","v":"T / 8"},"TS8-TS16","(9)",{"$f":"IF('SCORE PRIN'!K16='SCORE PRIN'!M16,\"\",CONCATENATE('SCORE PRIN'!K16,\" / \",'SCORE PRIN'!M16,\" (\",'SCORE PRIN'!N16,\"-\",'SCORE PRIN'!O16,\")(\",'SCORE PRIN'!P16,\"-\",'SCORE PRIN'!Q16,\")(\",'SCORE PRIN'!R16,\"-\",'SCORE PRIN'!S16,\")\"))","v":""},null,null,2,{"$f":"'SCORE PRIN'!AJ9","v":""},null,{"$f":"IF(J36=\"\",\"D3\",J36)","v":"D3"},null,"(29)",null,{"$f":"'SCORE PRIN'!T36","v":""}]
[null,"T9",{"$f":"CONCATENATE('EMARG M Tableau PRIN'!C17,\" / \",'EMARG M Tableau PRIN'!G17)","v":"T / 9"},"TS1-TS9","(13)",{"$f":"IF('SCORE PRIN'!K20='SCORE PRIN'!M20,\"\",CONCATENATE('SCORE PRIN'!K20,\" / \",'SCORE PRIN'!M20,\" (\",'SCORE PRIN'!N20,\"-\",'SCORE PRIN'!O20,\")(\",'SCORE PRIN'!P20,\"-\",'SCORE PRIN'!Q20,\")(\",'SCORE PRIN'!R20,\"-\",'SCORE PRIN'!S20,\")\"))","v":""},null,null,3,{"$f":"'SCORE PRIN'!AJ10","v":""},null,null,null,null,null,{"$f":"IF('SCORE PRIN'!K36='SCORE PRIN'!M36,\"\",CONCATENATE('SCORE PRIN'!K36,\" / \",'SCORE PRIN'!M36,\" (\",'SCORE PRIN'!N36,\"-\",'SCORE PRIN'!O36,\")(\",'SCORE PRIN'!P36,\"-\",'SCORE PRIN'!Q36,\")(\",'SCORE PRIN'!R36,\"-\",'SCORE PRIN'!S36,\")\"))","v":""}]
[null,"T16",{"$f":"CONCATENATE('EMARG M Tableau PRIN'!C24,\" / \",'EMARG M Tableau PRIN'!G24)","v":"T / 16"},"TS9-TS16","(17)",{"$f":"IF('SCORE PRIN'!K24='SCORE PRIN'!M24,\"\",CONCATENATE('SCORE PRIN'!K24,\" / \",'SCORE PRIN'!M24,\" (\",'SCORE PRIN'!N24,\"-\",'SCORE PRIN'!O24,\")(\",'SCORE PRIN'!P24,\"-\",'SCORE PRIN'!Q24,\")(\",'SCORE PRIN'!R24,\"-\",'SCORE PRIN'!S24,\")\"))","v":""},null,null,4,{"$f":"'SCORE PRIN'!AJ11","v":""},null,null,null,{"$f":"J28","v":""}]
[null,null,null,"TS1-TS8","(21)",{"$f":"IF('SCORE PRIN'!K28='SCORE PRIN'!M28,\"\",CONCATENATE('SCORE PRIN'!K28,\" / \",'SCORE PRIN'!M28,\" (\",'SCORE PRIN'!N28,\"-\",'SCORE PRIN'!O28,\")(\",'SCORE PRIN'!P28,\"-\",'SCORE PRIN'!Q28,\")(\",'SCORE PRIN'!R28,\"-\",'SCORE PRIN'!S28,\")\"))","v":""},null,null,null,null,null,{"$f":"IF(J28=\"\",\"C2\",J28)","v":"C2"},null,{"$f":"IF('SCORE PRIN'!K32='SCORE PRIN'!M32,\"\",CONCATENATE('SCORE PRIN'!K32,\" / \",'SCORE PRIN'!M32,\" (\",'SCORE PRIN'!N32,\"-\",'SCORE PRIN'!O32,\")(\",'SCORE PRIN'!P32,\"-\",'SCORE PRIN'!Q32,\")(\",'SCORE PRIN'!R32,\"-\",'SCORE PRIN'!S32,\")\"))","v":""}]
[null,null,null,null,null,null,null,null,null,null,null,null,null,null,null,"(33)",null,{"$f":"'SCORE PRIN'!T40","v":""}]
[null,null,null,"TS2-TS15","(2)",{"$f":"IF('SCORE PRIN'!K9='SCORE PRIN'!M9,\"\",CONCATENATE('SCORE PRIN'!K9,\" / \",'SCORE PRIN'!M9,\" (\",'SCORE PRIN'!N9,\"-\",'SCORE PRIN'!O9,\")(\",'SCORE PRIN'!P9,\"-\",'SCORE PRIN'!Q9,\")(\",'SCORE PRIN'!R9,\"-\",'SCORE PRIN'!S9,\")\"))","v":""},null,null,null,null,null,{"$f":"IF(J15=\"\",\"A3\",J15)","v":"A3"},null,null,null,null,null,{"$f":"IF('SCORE PRIN'!K40='SCORE PRIN'!M40,\"\",CONCATENATE('SCORE PRIN'!K40,\" / \",'SCORE PRIN'!M40,\" (\",'SCORE PRIN'!N40,\"-\",'SCORE PRIN'!O40,\")(\",'SCORE PRIN'!P40,\"-\",'SCORE PRIN'!Q40,\")(\",'SCORE PRIN'!R40,\"-\",'SCORE PRIN'!S40,\")\"))","v":""}]
[null,"T2",{"$f":"CONCATENATE('EMARG M Tableau PRIN'!C10,\" / \",'EMARG M Tableau PRIN'!G10)","v":"T / 2"},"TS7-TS10","(6)",{"$f":"IF('SCORE PRIN'!K13='SCORE PRIN'!M13,\"\",CONCATENATE('SCORE PRIN'!K13,\" / \",'SCORE PRIN'!M13,\" (\",'SCORE PRIN'!N13,\"-\",'SCORE PRIN'!O13,\")(\",'SCORE PRIN'!P13,\"-\",'SCORE PRIN'!Q13,\")(\",'SCORE PRIN'!R13,\"-\",'SCORE PRIN'!S13,\")\"))","v":""},null,null,1,{"$f":"'SCORE PRIN'!AJ13","v":""},null,null,null,{"$f":"J21","v":""}]
["B","T7",{"$f":"CONCATENATE('EMARG M Tableau PRIN'!C15,\" / \",'EMARG M Tableau PRIN'!G15)","v":"T / 7"},"TS7-TS15","(10)",{"$f":"IF('SCORE PRIN'!K17='SCORE PRIN'!M17,\"\",CONCATENATE('SCORE PRIN'!K17,\" / \",'SCORE PRIN'!M17,\" (\",'SCORE PRIN'!N17,\"-\",'SCORE PRIN'!O17,\")(\",'SCORE PRIN'!P17,\"-\",'SCORE PRIN'!Q17,\")(\",'SCORE PRIN'!R17,\"-\",'SCORE PRIN'!S17,\")\"))","v":""},null,null,2,{"$f":"'SCORE PRIN'!AJ14","v":""}]
[null,"T10",{"$f":"CONCATENATE('EMARG M Tableau PRIN'!C18,\" / \",'EMARG M Tableau PRIN'!G18)","v":"T / 10"},"TS2-TS10","(14)",{"$f":"IF('SCORE PRIN'!K21='SCORE PRIN'!M21,\"\",CONCATENATE('SCORE PRIN'!K21,\" / \",'SCORE PRIN'!M21,\" (\",'SCORE PRIN'!N21,\"-\",'SCORE PRIN'!O21,\")(\",'SCORE PRIN'!P21,\"-\",'SCORE PRIN'!Q21,\")(\",'SCORE PRIN'!R21,\"-\",'SCORE PRIN'!S21,\")\"))","v":""},null,null,3,{"$f":"'SCORE PRIN'!AJ15","v":""},null,{"$f":"IF(J21=\"\",\"B2\",J21)","v":"B2"},null,"(30)"]
[null,"T15",{"$f":"CONCATENATE('EMARG M Tableau PRIN'!C23,\" / \",'EMARG M Tableau PRIN'!G23)","v":"T / 15"},"TS10-TS15","(18)",{"$f":"IF('SCORE PRIN'!K25='SCORE PRIN'!M25,\"\",CONCATENATE('SCORE PRIN'!K25,\" / \",'SCORE PRIN'!M25,\" (\",'SCORE PRIN'!N25,\"-\",'SCORE PRIN'!O25,\")(\",'SCORE PRIN'!P25,\"-\",'SCORE PRIN'!Q25,\")(\",'SCORE PRIN'!R25,\"-\",'SCORE PRIN'!S25,\")\"))","v":""},null,null,4,{"$f":"'SCORE PRIN'!AJ16","v":""},null,null,null,null,null,{"$f":"'SCORE PRIN'!T37","v":""}]
[null,null,null,"TS2-TS7","(22)",{"$f":"IF('SCORE PRIN'!K29='SCORE PRIN'!M29,\"\",CONCATENATE('SCORE PRIN'!K29,\" / \",'SCORE PRIN'!M29,\" (\",'SCORE PRIN'!N29,\"-\",'SCORE PRIN'!O29,\")(\",'SCORE PRIN'!P29,\"-\",'SCORE PRIN'!Q29,\")(\",'SCORE PRIN'!R29,\"-\",'SCORE PRIN'!S29,\")\"))","v":""},null,null,null,null,null,null,null,{"$f":"IF(J34=\"\",\"D1\",J34)","v":"D1"},null,{"$f":"IF('SCORE PRIN'!K37='SCORE PRIN'!M37,\"\",CONCATENATE('SCORE PRIN'!K37,\" / \",'SCORE PRIN'!M37,\" (\",'SCORE PRIN'!N37,\"-\",'SCORE PRIN'!O37,\")(\",'SCORE PRIN'!P37,\"-\",'SCORE PRIN'!Q37,\")(\",'SCORE PRIN'!R37,\"-\",'SCORE PRIN'!S37,\")\"))","v":""}]
[null,null,null,null,null,null,null,null,null,null,null,null,null,{"$f":"IF('SCORE PRIN'!K33='SCORE PRIN'!M33,\"\",CONCATENATE('SCORE PRIN'!K33,\" / \",'SCORE PRIN'!M33,\" (\",'SCORE PRIN'!N33,\"-\",'SCORE PRIN'!O33,\")(\",'SCORE PRIN'!P33,\"-\",'SCORE PRIN'!Q33,\")(\",'SCORE PRIN'!R33,\"-\",'SCORE PRIN'!S33,\")\"))","v":""},null,null,null,null,{"$f":"'SCORE PRIN'!T43","v":""}]
[null,null,null,"TS3-TS14","(3)",{"$f":"IF('SCORE PRIN'!K10='SCORE PRIN'!M10,\"\",CONCATENATE('SCORE PRIN'!K10,\" / \",'SCORE PRIN'!M10,\" (\",'SCORE PRIN'!N10,\"-\",'SCORE PRIN'!O10,\")(\",'SCORE PRIN'!P10,\"-\",'SCORE PRIN'!Q10,\")(\",'SCORE PRIN'!R10,\"-\",'SCORE PRIN'!S10,\")\"))","v":""},null,null,null,null,null,null,null,null,null,null,null,null,{"$f":"IF('SCORE PRIN'!K43='SCORE PRIN'!M43,\"\",CONCATENATE('SCORE PRIN'!K43,\" / \",'SCORE PRIN'!M43,\" (\",'SCORE PRIN'!N43,\"-\",'SCORE PRIN'!O43,\")(\",'SCORE PRIN'!P43,\"-\",'SCORE PRIN'!Q43,\")(\",'SCORE PRIN'!R43,\"-\",'SCORE PRIN'!S43,\")\"))","v":""}]
[null,"T3",{"$f":"CONCATENATE('EMARG M Tableau PRIN'!C11,\" / \",'EMARG M Tableau PRIN'!G11)","v":"T / 3"},"TS6-TS11","(7)",{"$f":"IF('SCORE PRIN'!K14='SCORE PRIN'!M14,\"\",CONCATENATE('SCORE PRIN'!K14,\" / \",'SCORE PRIN'!M14,\" (\",'SCORE PRIN'!N14,\"-\",'SCORE PRIN'!O14,\")(\",'SCORE PRIN'!P14,\"-\",'SCORE PRIN'!Q14,\")(\",'SCORE PRIN'!R14,\"-\",'SCORE PRIN'!S14,\")\"))","v":""},null,null,1,{"$f":"'SCORE PRIN'!AJ18","v":""},null,null,null,{"$f":"IF(J27=\"\",\"C1\",J27)","v":"C1"},null,null,null,"(36)"]
["C","T6",{"$f":"CONCATENATE('EMARG M Tableau PRIN'!C14,\" / \",'EMARG M Tableau PRIN'!G14)","v":"T / 6"},"TS6-TS14","(11)",{"$f":"IF('SCORE PRIN'!K18='SCORE PRIN'!M18,\"\",CONCATENATE('SCORE PRIN'!K18,\" / \",'SCORE PRIN'!M18,\" (\",'SCORE PRIN'!N18,\"-\",'SCORE PRIN'!O18,\")(\",'SCORE PRIN'!P18,\"-\",'SCORE PRIN'!Q18,\")(\",'SCORE PRIN'!R18,\"-\",'SCORE PRIN'!S18,\")\"))","v":""},null,null,2,{"$f":"'SCORE PRIN'!AJ19","v":""}]
[null,"T11",{"$f":"CONCATENATE('EMARG M Tableau PRIN'!C19,\" / \",'EMARG M Tableau PRIN'!G19)","v":"T / 11"},"TS3-TS11","(15)",{"$f":"IF('SCORE PRIN'!K22='SCORE PRIN'!M22,\"\",CONCATENATE('SCORE PRIN'!K22,\" / \",'SCORE PRIN'!M22,\" (\",'SCORE PRIN'!N22,\"-\",'SCORE PRIN'!O22,\")(\",'SCORE PRIN'!P22,\"-\",'SCORE PRIN'!Q22,\")(\",'SCORE PRIN'!R22,\"-\",'SCORE PRIN'!S22,\")\"))","v":""},null,null,3,{"$f":"'SCORE PRIN'!AJ20","v":""},null,{"$f":"IF(J22=\"\",\"B3\",J22)","v":"B3"},null,"(31)",null,{"$f":"'SCORE PRIN'!T38","v":""}]
[null,"T14",{"$f":"CONCATENATE('EMARG M Tableau PRIN'!C22,\" / \",'EMARG M Tableau PRIN'!G22)","v":"T / 14"},"TS11-TS14","(19)",{"$f":"IF('SCORE PRIN'!K26='SCORE PRIN'!M26,\"\",CONCATENATE('SCORE PRIN'!K26,\" / \",'SCORE PRIN'!M26,\" (\",'SCORE PRIN'!N26,\"-\",'SCORE PRIN'!O26,\")(\",'SCORE PRIN'!P26,\"-\",'SCORE PRIN'!Q26,\")(\",'SCORE PRIN'!R26,\"-\",'SCORE PRIN'!S26,\")\"))","v":""},null,null,4,{"$f":"'SCORE PRIN'!AJ21","v":""},null,null,null,null,null,{"$f":"IF('SCORE PRIN'!K38='SCORE PRIN'!M38,\"\",CONCATENATE('SCORE PRIN'!K38,\" / \",'SCORE PRIN'!M38,\" (\",'SCORE PRIN'!N38,\"-\",'SCORE PRIN'!O38,\")(\",'SCORE PRIN'!P38,\"-\",'SCORE PRIN'!Q38,\")(\",'SCORE PRIN'!R38,\"-\",'SCORE PRIN'!S38,\")\"))","v":""}]
[null,null,null,"TS3-TS6","(23)",{"$f":"IF('SCORE PRIN'!K30='SCORE PRIN'!M30,\"\",CONCATENATE('SCORE PRIN'!K30,\" / \",'SCORE PRIN'!M30,\" (\",'SCORE PRIN'!N30,\"-\",'SCORE PRIN'!O30,\")(\",'SCORE PRIN'!P30,\"-\",'SCORE PRIN'!Q30,\")(\",'SCORE PRIN'!R30,\"-\",'SCORE PRIN'!S30,\")\"))","v":""},null,null,null,null,null,null,null,{"$f":"J14","v":""}]
[null,null,null,null,null,null,null,null,null,null,null,{"$f":"IF(J14=\"\",\"A2\",J14)","v":"A2"},null,{"$f":"IF('SCORE PRIN'!K34='SCORE PRIN'!M34,\"\",CONCATENATE('SCORE PRIN'!K34,\" / \",'SCORE PRIN'!M34,\" (\",'SCORE PRIN'!N34,\"-\",'SCORE PRIN'!O34,\")(\",'SCORE PRIN'!P34,\"-\",'SCORE PRIN'!Q34,\")(\",'SCORE PRIN'!R34,\"-\",'SCORE PRIN'!S34,\")\"))","v":""}]
[null,null,null,"TS4-TS13","(4)",{"$f":"IF('SCORE PRIN'!K11='SCORE PRIN'!M11,\"\",CONCATENATE('SCORE PRIN'!K11,\" / \",'SCORE PRIN'!M11,\" (\",'SCORE PRIN'!N11,\"-\",'SCORE PRIN'!O11,\")(\",'SCORE PRIN'!P11,\"-\",'SCORE PRIN'!Q11,\")(\",'SCORE PRIN'!R11,\"-\",'SCORE PRIN'!S11,\")\"))","v":""},null,null,null,null,null,null,null,null,null,"(34)",null,{"$f":"'SCORE PRIN'!T41","v":""}]
[null,"T4",{"$f":"CONCATENATE('EMARG M Tableau PRIN'!C12,\" / \",'EMARG M Tableau PRIN'!G12)","v":"T / 4"},"TS5-TS12","(8)",{"$f":"IF('SCORE PRIN'!K15='SCORE PRIN'!M15,\"\",CONCATENATE('SCORE PRIN'!K15,\" / \",'SCORE PRIN'!M15,\" (\",'SCORE PRIN'!N15,\"-\",'SCORE PRIN'!O15,\")(\",'SCORE PRIN'!P15,\"-\",'SCORE PRIN'!Q15,\")(\",'SCORE PRIN'!R15,\"-\",'SCORE PRIN'!S15,\")\"))","v":""},null,null,1,{"$f":"'SCORE PRIN'!AJ23","v":""},null,{"$f":"IF(J35=\"\",\"D2\",J35)","v":"D2"},null,null,null,null,null,{"$f":"IF('SCORE PRIN'!K41='SCORE PRIN'!M41,\"\",CONCATENATE('SCORE PRIN'!K41,\" / \",'SCORE PRIN'!M41,\" (\",'SCORE PRIN'!N41,\"-\",'SCORE PRIN'!O41,\")(\",'SCORE PRIN'!P41,\"-\",'SCORE PRIN'!Q41,\")(\",'SCORE PRIN'!R41,\"-\",'SCORE PRIN'!S41,\")\"))","v":""}]
["D","T5",{"$f":"CONCATENATE('EMARG M Tableau PRIN'!C13,\" / \",'EMARG M Tableau PRIN'!G13)","v":"T / 5"},"TS5-TS13","(12)",{"$f":"IF('SCORE PRIN'!K19='SCORE PRIN'!M19,\"\",CONCATENATE('SCORE PRIN'!K19,\" / \",'SCORE PRIN'!M19,\" (\",'SCORE PRIN'!N19,\"-\",'SCORE PRIN'!O19,\")(\",'SCORE PRIN'!P19,\"-\",'SCORE PRIN'!Q19,\")(\",'SCORE PRIN'!R19,\"-\",'SCORE PRIN'!S19,\")\"))","v":""},null,null,2,{"$f":"'SCORE PRIN'!AJ24","v":""},null,null,null,{"$f":"J35","v":""}]
[null,"T12",{"$f":"CONCATENATE('EMARG M Tableau PRIN'!C20,\" /\",'EMARG M Tableau PRIN'!G20)","v":"T /12"},"TS4-TS12","(16)",{"$f":"IF('SCORE PRIN'!K23='SCORE PRIN'!M23,\"\",CONCATENATE('SCORE PRIN'!K23,\" / \",'SCORE PRIN'!M23,\" (\",'SCORE PRIN'!N23,\"-\",'SCORE PRIN'!O23,\")(\",'SCORE PRIN'!P23,\"-\",'SCORE PRIN'!Q23,\")(\",'SCORE PRIN'!R23,\"-\",'SCORE PRIN'!S23,\")\"))","v":""},null,null,3,{"$f":"'SCORE PRIN'!AJ25","v":""},null,null,null,{"$f":"IF('SCORE PRIN'!K35='SCORE PRIN'!M35,\"\",CONCATENATE('SCORE PRIN'!K35,\" / \",'SCORE PRIN'!M35,\" (\",'SCORE PRIN'!N35,\"-\",'SCORE PRIN'!O35,\")(\",'SCORE PRIN'!P35,\"-\",'SCORE PRIN'!Q35,\")(\",'SCORE PRIN'!R35,\"-\",'SCORE PRIN'!S35,\")\"))","v":""}]
[null,"T13",{"$f":"CONCATENATE('EMARG M Tableau PRIN'!C21,\" / \",'EMARG M Tableau PRIN'!G21)","v":"T / 13"},"TS12-TS13","(20)",{"$f":"IF('SCORE PRIN'!K27='SCORE PRIN'!M27,\"\",CONCATENATE('SCORE PRIN'!K27,\" / \",'SCORE PRIN'!M27,\" (\",'SCORE PRIN'!N27,\"-\",'SCORE PRIN'!O27,\")(\",'SCORE PRIN'!P27,\"-\",'SCORE PRIN'!Q27,\")(\",'SCORE PRIN'!R27,\"-\",'SCORE PRIN'!S27,\")\"))","v":""},null,null,4,{"$f":"'SCORE PRIN'!AJ26","v":""},null,{"$f":"IF(J29=\"\",\"C3\",J29)","v":"C3"},null,"(32)",null,{"$f":"'SCORE PRIN'!T39","v":""}]
[null,null,null,"TS4-TS5","(24)",{"$f":"IF('SCORE PRIN'!K31='SCORE PRIN'!M31,\"\",CONCATENATE('SCORE PRIN'!K31,\" / \",'SCORE PRIN'!M31,\" (\",'SCORE PRIN'!N31,\"-\",'SCORE PRIN'!O31,\")(\",'SCORE PRIN'!P31,\"-\",'SCORE PRIN'!Q31,\")(\",'SCORE PRIN'!R31,\"-\",'SCORE PRIN'!S31,\")\"))","v":""},null,null,null,null,null,null,null,null,null,{"$f":"IF('SCORE PRIN'!K39='SCORE PRIN'!M39,\"\",CONCATENATE('SCORE PRIN'!K39,\" / \",'SCORE PRIN'!M39,\" (\",'SCORE PRIN'!N39,\"-\",'SCORE PRIN'!O39,\")(\",'SCORE PRIN'!P39,\"-\",'SCORE PRIN'!Q39,\")(\",'SCORE PRIN'!R39,\"-\",'SCORE PRIN'!S39,\")\"))","v":""}]
[null,null,null,null,null,null,null,null,null,null,null,null,null,{"$f":"IF(J20=\"\",\"B1\",J20)","v":"B1"}]
[null,null,null,null,null,null,null,null,null,null,null,null,null,null,null,null,null,{"$f":"'SCORE PRIN'!U40","v":""}]
[]
[null,null,null,null,null,null,null,null,null,null,null,null,null,null,null,null,null,"(35)",{"$f":"'SCORE PRIN'!T42","v":""}]
[null,null,null,null,null,null,null,null,null,null,null,null,null,null,null,null,null,null,{"$f":"IF('SCORE PRIN'!K42='SCORE PRIN'!M42,\"\",CONCATENATE('SCORE PRIN'!K42,\" / \",'SCORE PRIN'!M42,\" (\",'SCORE PRIN'!N42,\"-\",'SCORE PRIN'!O42,\")(\",'SCORE PRIN'!P42,\"-\",'SCORE PRIN'!Q42,\")(\",'SCORE PRIN'!R42,\"-\",'SCORE PRIN'!S42,\")\"))","v":""}]
[]
[null,null,null,null,null,null,null,null,null,null,null,null,null,null,null,null,null,{"$f":"'SCORE PRIN'!U41","v":""}]

{"sheet":"RELEVE","index":10,"n_rows":97,"n_cols":14,"rows_kept":97,"cut":false,"hidden":false,"merged":[[9,8,9,9],[2,2,2,3],[2,4,2,10],[3,2,3,3],[3,4,3,5],[4,2,4,3],[4,4,4,5],[5,2,5,3],[5,4,5,5],[6,2,6,3],[6,4,6,5],[8,8,8,9],[96,2,102,10],[14,4,14,6],[15,2,15,3],[15,4,15,6],[16,2,16,3],[16,4,16,6],[17,2,17,3],[17,4,17,6],[18,2,18,3],[18,4,18,6],[19,2,19,3],[19,4,19,6],[87,2,93,10]]}
[null,null,"RELEVE DES RESULTATS ET SANCTIONS - TOURNOI DE BEACH VOLLEY"]
[]
[null,null,"APPELATION DU TOURNOI",null,{"$f":"IF('LISTE ENGAGES'!R3=\"\",\"\",'LISTE ENGAGES'!R3)","v":""}]
[null,null,"TYPE",null,{"$f":"IF('LISTE ENGAGES'!R5=\"\",\"\",'LISTE ENGAGES'!R5)","v":""}]
[null,null,"GENRE",null,{"$f":"IF('LISTE ENGAGES'!R9=\"\",\"\",'LISTE ENGAGES'!R9)","v":""}]
[null,null,"DATE",null,{"$f":"IF('LISTE ENGAGES'!R7=\"\",\"\",CONCATENATE('LISTE ENGAGES'!R7,\"-\",'LISTE ENGAGES'!R8,\"/\",'LISTE ENGAGES'!R6))","v":""}]
[null,null,"ORGANISATEUR",null,{"$f":"IF('LISTE ENGAGES'!R10=\"\",\"\",'LISTE ENGAGES'!R10)","v":""}]
[]
[null,null,"NOMBRE EQUIPE TABLEAU :",null,null,"PRINCIPAL",null,null,"QUALIFICATION"]
[null,null,"NOMBRE EQUIPE PRESENTES PAR TABLEAU",null,null,"PRINCIPAL",null,null,"QUALIFICATION"]
[]
[]
[null,null,"COMPOSITION DE LA COMMISSION DE DIRECTION"]
[]
[null,null,"DELEGUE INSTANCE FEDERAL"]
[null,null,"SUPERVISEUR"]
[null,null,"JUGE ARBITRE"]
[null,null,"ORGANISATEUR"]
[null,null,"REPRESENTANT JOUEURS"]
[null,null,"RAPPORTEUR*"]
[]
[]
[]
[]
[]
[null,null,"EQUIPES ABSENTES"]
[null,null,"NOM","PRENOM","LIC J1","club J1","NOM2","PRENOM3","LIC J2","club J2"]
[]
[]
[]
[]
[]
[]
[null,null,"RECLAMATIONS"]
[null,null,"NOM","PRENOM","LIC J1","club J1","NOM2","PRENOM3","LIC J2","club J2","RANG","NIVEAU","MOTIF ","AVIS COMMISSION"]
[null,1]
[null,2]
[null,3]
[null,4]
[null,5]
[null,6]
[]
[null,null,"EQUIPES/JOUEURS SANCTIONNES"]
[null,null,"NOM","PRENOM","LIC J1","club J1","NOM2","PRENOM3","LIC J2","club J2","RANG","SANCTION","MOTIF ","AVIS COMMISSION"]
[null,1]
[null,2]
[null,3]
[null,4]
[null,5]
[null,6]
[]
[null,null,"CLASSEMENT FINAL"]
[null,null,"NOM","PRENOM","LIC J1","club J1","NOM2","PRENOM3","LIC J2","club J2","RANG"]
[null,null,{"$f":"IF('LISTE ENGAGES'!C9=\"\",\"\",'LISTE ENGAGES'!C9)","v":""},{"$f":"IF('LISTE ENGAGES'!D9=\"\",\"\",'LISTE ENGAGES'!D9)","v":""},{"$f":"IF('LISTE ENGAGES'!E9=\"\",\"\",'LISTE ENGAGES'!E9)","v":""},{"$f":"IF('LISTE ENGAGES'!F9=\"\",\"\",'LISTE ENGAGES'!F9)","v":""},{"$f":"IF('LISTE ENGAGES'!G9=\"\",\"\",'LISTE ENGAGES'!G9)","v":""},{"$f":"IF('LISTE ENGAGES'!H9=\"\",\"\",'LISTE ENGAGES'!H9)","v":""},{"$f":"IF('LISTE ENGAGES'!I9=\"\",\"\",'LISTE ENGAGES'!I9)","v":""},{"$f":"IF('LISTE ENGAGES'!J9=\"\",\"\",'LISTE ENGAGES'!J9)","v":""}]
[null,null,{"$f":"IF('LISTE ENGAGES'!C10=\"\",\"\",'LISTE ENGAGES'!C10)","v":""},{"$f":"IF('LISTE ENGAGES'!D10=\"\",\"\",'LISTE ENGAGES'!D10)","v":""},{"$f":"IF('LISTE ENGAGES'!E10=\"\",\"\",'LISTE ENGAGES'!E10)","v":""},{"$f":"IF('LISTE ENGAGES'!F10=\"\",\"\",'LISTE ENGAGES'!F10)","v":""},{"$f":"IF('LISTE ENGAGES'!G10=\"\",\"\",'LISTE ENGAGES'!G10)","v":""},{"$f":"IF('LISTE ENGAGES'!H10=\"\",\"\",'LISTE ENGAGES'!H10)","v":""},{"$f":"IF('LISTE ENGAGES'!I10=\"\",\"\",'LISTE ENGAGES'!I10)","v":""},{"$f":"IF('LISTE ENGAGES'!J10=\"\",\"\",'LISTE ENGAGES'!J10)","v":""}]
[null,null,{"$f":"IF('LISTE ENGAGES'!C11=\"\",\"\",'LISTE ENGAGES'!C11)","v":""},{"$f":"IF('LISTE ENGAGES'!D11=\"\",\"\",'LISTE ENGAGES'!D11)","v":""},{"$f":"IF('LISTE ENGAGES'!E11=\"\",\"\",'LISTE ENGAGES'!E11)","v":""},{"$f":"IF('LISTE ENGAGES'!F11=\"\",\"\",'LISTE ENGAGES'!F11)","v":""},{"$f":"IF('LISTE ENGAGES'!G11=\"\",\"\",'LISTE ENGAGES'!G11)","v":""},{"$f":"IF('LISTE ENGAGES'!H11=\"\",\"\",'LISTE ENGAGES'!H11)","v":""},{"$f":"IF('LISTE ENGAGES'!I11=\"\",\"\",'LISTE ENGAGES'!I11)","v":""},{"$f":"IF('LISTE ENGAGES'!J11=\"\",\"\",'LISTE ENGAGES'!J11)","v":""}]
[null,null,{"$f":"IF('LISTE ENGAGES'!C12=\"\",\"\",'LISTE ENGAGES'!C12)","v":""},{"$f":"IF('LISTE ENGAGES'!D12=\"\",\"\",'LISTE ENGAGES'!D12)","v":""},{"$f":"IF('LISTE ENGAGES'!E12=\"\",\"\",'LISTE ENGAGES'!E12)","v":""},{"$f":"IF('LISTE ENGAGES'!F12=\"\",\"\",'LISTE ENGAGES'!F12)","v":""},{"$f":"IF('LISTE ENGAGES'!G12=\"\",\"\",'LISTE ENGAGES'!G12)","v":""},{"$f":"IF('LISTE ENGAGES'!H12=\"\",\"\",'LISTE ENGAGES'!H12)","v":""},{"$f":"IF('LISTE ENGAGES'!I12=\"\",\"\",'LISTE ENGAGES'!I12)","v":""},{"$f":"IF('LISTE ENGAGES'!J12=\"\",\"\",'LISTE ENGAGES'!J12)","v":""}]
[null,null,{"$f":"IF('LISTE ENGAGES'!C13=\"\",\"\",'LISTE ENGAGES'!C13)","v":""},{"$f":"IF('LISTE ENGAGES'!D13=\"\",\"\",'LISTE ENGAGES'!D13)","v":""},{"$f":"IF('LISTE ENGAGES'!E13=\"\",\"\",'LISTE ENGAGES'!E13)","v":""},{"$f":"IF('LISTE ENGAGES'!F13=\"\",\"\",'LISTE ENGAGES'!F13)","v":""},{"$f":"IF('LISTE ENGAGES'!G13=\"\",\"\",'LISTE ENGAGES'!G13)","v":""},{"$f":"IF('LISTE ENGAGES'!H13=\"\",\"\",'LISTE ENGAGES'!H13)","v":""},{"$f":"IF('LISTE ENGAGES'!I13=\"\",\"\",'LISTE ENGAGES'!I13)","v":""},{"$f":"IF('LISTE ENGAGES'!J13=\"\",\"\",'LISTE ENGAGES'!J13)","v":""}]
[null,null,{"$f":"IF('LISTE ENGAGES'!C14=\"\",\"\",'LISTE ENGAGES'!C14)","v":""},{"$f":"IF('LISTE ENGAGES'!D14=\"\",\"\",'LISTE ENGAGES'!D14)","v":""},{"$f":"IF('LISTE ENGAGES'!E14=\"\",\"\",'LISTE ENGAGES'!E14)","v":""},{"$f":"IF('LISTE ENGAGES'!F14=\"\",\"\",'LISTE ENGAGES'!F14)","v":""},{"$f":"IF('LISTE ENGAGES'!G14=\"\",\"\",'LISTE ENGAGES'!G14)","v":""},{"$f":"IF('LISTE ENGAGES'!H14=\"\",\"\",'LISTE ENGAGES'!H14)","v":""},{"$f":"IF('LISTE ENGAGES'!I14=\"\",\"\",'LISTE ENGAGES'!I14)","v":""},{"$f":"IF('LISTE ENGAGES'!J14=\"\",\"\",'LISTE ENGAGES'!J14)","v":""}]
[null,null,{"$f":"IF('LISTE ENGAGES'!C15=\"\",\"\",'LISTE ENGAGES'!C15)","v":""},{"$f":"IF('LISTE ENGAGES'!D15=\"\",\"\",'LISTE ENGAGES'!D15)","v":""},{"$f":"IF('LISTE ENGAGES'!E15=\"\",\"\",'LISTE ENGAGES'!E15)","v":""},{"$f":"IF('LISTE ENGAGES'!F15=\"\",\"\",'LISTE ENGAGES'!F15)","v":""},{"$f":"IF('LISTE ENGAGES'!G15=\"\",\"\",'LISTE ENGAGES'!G15)","v":""},{"$f":"IF('LISTE ENGAGES'!H15=\"\",\"\",'LISTE ENGAGES'!H15)","v":""},{"$f":"IF('LISTE ENGAGES'!I15=\"\",\"\",'LISTE ENGAGES'!I15)","v":""},{"$f":"IF('LISTE ENGAGES'!J15=\"\",\"\",'LISTE ENGAGES'!J15)","v":""}]
[null,null,{"$f":"IF('LISTE ENGAGES'!C16=\"\",\"\",'LISTE ENGAGES'!C16)","v":""},{"$f":"IF('LISTE ENGAGES'!D16=\"\",\"\",'LISTE ENGAGES'!D16)","v":""},{"$f":"IF('LISTE ENGAGES'!E16=\"\",\"\",'LISTE ENGAGES'!E16)","v":""},{"$f":"IF('LISTE ENGAGES'!F16=\"\",\"\",'LISTE ENGAGES'!F16)","v":""},{"$f":"IF('LISTE ENGAGES'!G16=\"\",\"\",'LISTE ENGAGES'!G16)","v":""},{"$f":"IF('LISTE ENGAGES'!H16=\"\",\"\",'LISTE ENGAGES'!H16)","v":""},{"$f":"IF('LISTE ENGAGES'!I16=\"\",\"\",'LISTE ENGAGES'!I16)","v":""},{"$f":"IF('LISTE ENGAGES'!J16=\"\",\"\",'LISTE ENGAGES'!J16)","v":""}]
[null,null,{"$f":"IF('LISTE ENGAGES'!C17=\"\",\"\",'LISTE ENGAGES'!C17)","v":""},{"$f":"IF('LISTE ENGAGES'!D17=\"\",\"\",'LISTE ENGAGES'!D17)","v":""},{"$f":"IF('LISTE ENGAGES'!E17=\"\",\"\",'LISTE ENGAGES'!E17)","v":""},{"$f":"IF('LISTE ENGAGES'!F17=\"\",\"\",'LISTE ENGAGES'!F17)","v":""},{"$f":"IF('LISTE ENGAGES'!G17=\"\",\"\",'LISTE ENGAGES'!G17)","v":""},{"$f":"IF('LISTE ENGAGES'!H17=\"\",\"\",'LISTE ENGAGES'!H17)","v":""},{"$f":"IF('LISTE ENGAGES'!I17=\"\",\"\",'LISTE ENGAGES'!I17)","v":""},{"$f":"IF('LISTE ENGAGES'!J17=\"\",\"\",'LISTE ENGAGES'!J17)","v":""}]
[null,null,{"$f":"IF('LISTE ENGAGES'!C18=\"\",\"\",'LISTE ENGAGES'!C18)","v":""},{"$f":"IF('LISTE ENGAGES'!D18=\"\",\"\",'LISTE ENGAGES'!D18)","v":""},{"$f":"IF('LISTE ENGAGES'!E18=\"\",\"\",'LISTE ENGAGES'!E18)","v":""},{"$f":"IF('LISTE ENGAGES'!F18=\"\",\"\",'LISTE ENGAGES'!F18)","v":""},{"$f":"IF('LISTE ENGAGES'!G18=\"\",\"\",'LISTE ENGAGES'!G18)","v":""},{"$f":"IF('LISTE ENGAGES'!H18=\"\",\"\",'LISTE ENGAGES'!H18)","v":""},{"$f":"IF('LISTE ENGAGES'!I18=\"\",\"\",'LISTE ENGAGES'!I18)","v":""},{"$f":"IF('LISTE ENGAGES'!J18=\"\",\"\",'LISTE ENGAGES'!J18)","v":""}]
[null,null,{"$f":"IF('LISTE ENGAGES'!C19=\"\",\"\",'LISTE ENGAGES'!C19)","v":""},{"$f":"IF('LISTE ENGAGES'!D19=\"\",\"\",'LISTE ENGAGES'!D19)","v":""},{"$f":"IF('LISTE ENGAGES'!E19=\"\",\"\",'LISTE ENGAGES'!E19)","v":""},{"$f":"IF('LISTE ENGAGES'!F19=\"\",\"\",'LISTE ENGAGES'!F19)","v":""},{"$f":"IF('LISTE ENGAGES'!G19=\"\",\"\",'LISTE ENGAGES'!G19)","v":""},{"$f":"IF('LISTE ENGAGES'!H19=\"\",\"\",'LISTE ENGAGES'!H19)","v":""},{"$f":"IF('LISTE ENGAGES'!I19=\"\",\"\",'LISTE ENGAGES'!I19)","v":""},{"$f":"IF('LISTE ENGAGES'!J19=\"\",\"\",'LISTE ENGAGES'!J19)","v":""}]
[null,null,{"$f":"IF('LISTE ENGAGES'!C20=\"\",\"\",'LISTE ENGAGES'!C20)","v":""},{"$f":"IF('LISTE ENGAGES'!D20=\"\",\"\",'LISTE ENGAGES'!D20)","v":""},{"$f":"IF('LISTE ENGAGES'!E20=\"\",\"\",'LISTE ENGAGES'!E20)","v":""},{"$f":"IF('LISTE ENGAGES'!F20=\"\",\"\",'LISTE ENGAGES'!F20)","v":""},{"$f":"IF('LISTE ENGAGES'!G20=\"\",\"\",'LISTE ENGAGES'!G20)","v":""},{"$f":"IF('LISTE ENGAGES'!H20=\"\",\"\",'LISTE ENGAGES'!H20)","v":""},{"$f":"IF('LISTE ENGAGES'!I20=\"\",\"\",'LISTE ENGAGES'!I20)","v":""},{"$f":"IF('LISTE ENGAGES'!J20=\"\",\"\",'LISTE ENGAGES'!J20)","v":""}]
[null,null,{"$f":"IF('LISTE ENGAGES'!C21=\"\",\"\",'LISTE ENGAGES'!C21)","v":""},{"$f":"IF('LISTE ENGAGES'!D21=\"\",\"\",'LISTE ENGAGES'!D21)","v":""},{"$f":"IF('LISTE ENGAGES'!E21=\"\",\"\",'LISTE ENGAGES'!E21)","v":""},{"$f":"IF('LISTE ENGAGES'!F21=\"\",\"\",'LISTE ENGAGES'!F21)","v":""},{"$f":"IF('LISTE ENGAGES'!G21=\"\",\"\",'LISTE ENGAGES'!G21)","v":""},{"$f":"IF('LISTE ENGAGES'!H21=\"\",\"\",'LISTE ENGAGES'!H21)","v":""},{"$f":"IF('LISTE ENGAGES'!I21=\"\",\"\",'LISTE ENGAGES'!I21)","v":""},{"$f":"IF('LISTE ENGAGES'!J21=\"\",\"\",'LISTE ENGAGES'!J21)","v":""}]
[null,null,{"$f":"IF('LISTE ENGAGES'!C22=\"\",\"\",'LISTE ENGAGES'!C22)","v":""},{"$f":"IF('LISTE ENGAGES'!D22=\"\",\"\",'LISTE ENGAGES'!D22)","v":""},{"$f":"IF('LISTE ENGAGES'!E22=\"\",\"\",'LISTE ENGAGES'!E22)","v":""},{"$f":"IF('LISTE ENGAGES'!F22=\"\",\"\",'LISTE ENGAGES'!F22)","v":""},{"$f":"IF('LISTE ENGAGES'!G22=\"\",\"\",'LISTE ENGAGES'!G22)","v":""},{"$f":"IF('LISTE ENGAGES'!H22=\"\",\"\",'LISTE ENGAGES'!H22)","v":""},{"$f":"IF('LISTE ENGAGES'!I22=\"\",\"\",'LISTE ENGAGES'!I22)","v":""},{"$f":"IF('LISTE ENGAGES'!J22=\"\",\"\",'LISTE ENGAGES'!J22)","v":""}]
[null,null,{"$f":"IF('LISTE ENGAGES'!C23=\"\",\"\",'LISTE ENGAGES'!C23)","v":""},{"$f":"IF('LISTE ENGAGES'!D23=\"\",\"\",'LISTE ENGAGES'!D23)","v":""},{"$f":"IF('LISTE ENGAGES'!E23=\"\",\"\",'LISTE ENGAGES'!E23)","v":""},{"$f":"IF('LISTE ENGAGES'!F23=\"\",\"\",'LISTE ENGAGES'!F23)","v":""},{"$f":"IF('LISTE ENGAGES'!G23=\"\",\"\",'LISTE ENGAGES'!G23)","v":""},{"$f":"IF('LISTE ENGAGES'!H23=\"\",\"\",'LISTE ENGAGES'!H23)","v":""},{"$f":"IF('LISTE ENGAGES'!I23=\"\",\"\",'LISTE ENGAGES'!I23)","v":""},{"$f":"IF('LISTE ENGAGES'!J23=\"\",\"\",'LISTE ENGAGES'!J23)","v":""}]
[null,null,{"$f":"IF('LISTE ENGAGES'!C24=\"\",\"\",'LISTE ENGAGES'!C24)","v":""},{"$f":"IF('LISTE ENGAGES'!D24=\"\",\"\",'LISTE ENGAGES'!D24)","v":""},{"$f":"IF('LISTE ENGAGES'!E24=\"\",\"\",'LISTE ENGAGES'!E24)","v":""},{"$f":"IF('LISTE ENGAGES'!F24=\"\",\"\",'LISTE ENGAGES'!F24)","v":""},{"$f":"IF('LISTE ENGAGES'!G24=\"\",\"\",'LISTE ENGAGES'!G24)","v":""},{"$f":"IF('LISTE ENGAGES'!H24=\"\",\"\",'LISTE ENGAGES'!H24)","v":""},{"$f":"IF('LISTE ENGAGES'!I24=\"\",\"\",'LISTE ENGAGES'!I24)","v":""},{"$f":"IF('LISTE ENGAGES'!J24=\"\",\"\",'LISTE ENGAGES'!J24)","v":""}]
[null,null,{"$f":"IF('LISTE ENGAGES'!C25=\"\",\"\",'LISTE ENGAGES'!C25)","v":""},{"$f":"IF('LISTE ENGAGES'!D25=\"\",\"\",'LISTE ENGAGES'!D25)","v":""},{"$f":"IF('LISTE ENGAGES'!E25=\"\",\"\",'LISTE ENGAGES'!E25)","v":""},{"$f":"IF('LISTE ENGAGES'!F25=\"\",\"\",'LISTE ENGAGES'!F25)","v":""},{"$f":"IF('LISTE ENGAGES'!G25=\"\",\"\",'LISTE ENGAGES'!G25)","v":""},{"$f":"IF('LISTE ENGAGES'!H25=\"\",\"\",'LISTE ENGAGES'!H25)","v":""},{"$f":"IF('LISTE ENGAGES'!I25=\"\",\"\",'LISTE ENGAGES'!I25)","v":""},{"$f":"IF('LISTE ENGAGES'!J25=\"\",\"\",'LISTE ENGAGES'!J25)","v":""}]
[null,null,{"$f":"IF('LISTE ENGAGES'!C26=\"\",\"\",'LISTE ENGAGES'!C26)","v":""},{"$f":"IF('LISTE ENGAGES'!D26=\"\",\"\",'LISTE ENGAGES'!D26)","v":""},{"$f":"IF('LISTE ENGAGES'!E26=\"\",\"\",'LISTE ENGAGES'!E26)","v":""},{"$f":"IF('LISTE ENGAGES'!F26=\"\",\"\",'LISTE ENGAGES'!F26)","v":""},{"$f":"IF('LISTE ENGAGES'!G26=\"\",\"\",'LISTE ENGAGES'!G26)","v":""},{"$f":"IF('LISTE ENGAGES'!H26=\"\",\"\",'LISTE ENGAGES'!H26)","v":""},{"$f":"IF('LISTE ENGAGES'!I26=\"\",\"\",'LISTE ENGAGES'!I26)","v":""},{"$f":"IF('LISTE ENGAGES'!J26=\"\",\"\",'LISTE ENGAGES'!J26)","v":""}]
[null,null,{"$f":"IF('LISTE ENGAGES'!C27=\"\",\"\",'LISTE ENGAGES'!C27)","v":""},{"$f":"IF('LISTE ENGAGES'!D27=\"\",\"\",'LISTE ENGAGES'!D27)","v":""},{"$f":"IF('LISTE ENGAGES'!E27=\"\",\"\",'LISTE ENGAGES'!E27)","v":""},{"$f":"IF('LISTE ENGAGES'!F27=\"\",\"\",'LISTE ENGAGES'!F27)","v":""},{"$f":"IF('LISTE ENGAGES'!G27=\"\",\"\",'LISTE ENGAGES'!G27)","v":""},{"$f":"IF('LISTE ENGAGES'!H27=\"\",\"\",'LISTE ENGAGES'!H27)","v":""},{"$f":"IF('LISTE ENGAGES'!I27=\"\",\"\",'LISTE ENGAGES'!I27)","v":""},{"$f":"IF('LISTE ENGAGES'!J27=\"\",\"\",'LISTE ENGAGES'!J27)","v":""}]
[null,null,{"$f":"IF('LISTE ENGAGES'!C28=\"\",\"\",'LISTE ENGAGES'!C28)","v":""},{"$f":"IF('LISTE ENGAGES'!D28=\"\",\"\",'LISTE ENGAGES'!D28)","v":""},{"$f":"IF('LISTE ENGAGES'!E28=\"\",\"\",'LISTE ENGAGES'!E28)","v":""},{"$f":"IF('LISTE ENGAGES'!F28=\"\",\"\",'LISTE ENGAGES'!F28)","v":""},{"$f":"IF('LISTE ENGAGES'!G28=\"\",\"\",'LISTE ENGAGES'!G28)","v":""},{"$f":"IF('LISTE ENGAGES'!H28=\"\",\"\",'LISTE ENGAGES'!H28)","v":""},{"$f":"IF('LISTE ENGAGES'!I28=\"\",\"\",'LISTE ENGAGES'!I28)","v":""},{"$f":"IF('LISTE ENGAGES'!J28=\"\",\"\",'LISTE ENGAGES'!J28)","v":""}]
[null,null,{"$f":"IF('LISTE ENGAGES'!C29=\"\",\"\",'LISTE ENGAGES'!C29)","v":""},{"$f":"IF('LISTE ENGAGES'!D29=\"\",\"\",'LISTE ENGAGES'!D29)","v":""},{"$f":"IF('LISTE ENGAGES'!E29=\"\",\"\",'LISTE ENGAGES'!E29)","v":""},{"$f":"IF('LISTE ENGAGES'!F29=\"\",\"\",'LISTE ENGAGES'!F29)","v":""},{"$f":"IF('LISTE ENGAGES'!G29=\"\",\"\",'LISTE ENGAGES'!G29)","v":""},{"$f":"IF('LISTE ENGAGES'!H29=\"\",\"\",'LISTE ENGAGES'!H29)","v":""},{"$f":"IF('LISTE ENGAGES'!I29=\"\",\"\",'LISTE ENGAGES'!I29)","v":""},{"$f":"IF('LISTE ENGAGES'!J29=\"\",\"\",'LISTE ENGAGES'!J29)","v":""}]
[null,null,{"$f":"IF('LISTE ENGAGES'!C30=\"\",\"\",'LISTE ENGAGES'!C30)","v":""},{"$f":"IF('LISTE ENGAGES'!D30=\"\",\"\",'LISTE ENGAGES'!D30)","v":""},{"$f":"IF('LISTE ENGAGES'!E30=\"\",\"\",'LISTE ENGAGES'!E30)","v":""},{"$f":"IF('LISTE ENGAGES'!F30=\"\",\"\",'LISTE ENGAGES'!F30)","v":""},{"$f":"IF('LISTE ENGAGES'!G30=\"\",\"\",'LISTE ENGAGES'!G30)","v":""},{"$f":"IF('LISTE ENGAGES'!H30=\"\",\"\",'LISTE ENGAGES'!H30)","v":""},{"$f":"IF('LISTE ENGAGES'!I30=\"\",\"\",'LISTE ENGAGES'!I30)","v":""},{"$f":"IF('LISTE ENGAGES'!J30=\"\",\"\",'LISTE ENGAGES'!J30)","v":""}]
[null,null,{"$f":"IF('LISTE ENGAGES'!C31=\"\",\"\",'LISTE ENGAGES'!C31)","v":""},{"$f":"IF('LISTE ENGAGES'!D31=\"\",\"\",'LISTE ENGAGES'!D31)","v":""},{"$f":"IF('LISTE ENGAGES'!E31=\"\",\"\",'LISTE ENGAGES'!E31)","v":""},{"$f":"IF('LISTE ENGAGES'!F31=\"\",\"\",'LISTE ENGAGES'!F31)","v":""},{"$f":"IF('LISTE ENGAGES'!G31=\"\",\"\",'LISTE ENGAGES'!G31)","v":""},{"$f":"IF('LISTE ENGAGES'!H31=\"\",\"\",'LISTE ENGAGES'!H31)","v":""},{"$f":"IF('LISTE ENGAGES'!I31=\"\",\"\",'LISTE ENGAGES'!I31)","v":""},{"$f":"IF('LISTE ENGAGES'!J31=\"\",\"\",'LISTE ENGAGES'!J31)","v":""}]
[null,null,{"$f":"IF('LISTE ENGAGES'!C32=\"\",\"\",'LISTE ENGAGES'!C32)","v":""},{"$f":"IF('LISTE ENGAGES'!D32=\"\",\"\",'LISTE ENGAGES'!D32)","v":""},{"$f":"IF('LISTE ENGAGES'!E32=\"\",\"\",'LISTE ENGAGES'!E32)","v":""},{"$f":"IF('LISTE ENGAGES'!F32=\"\",\"\",'LISTE ENGAGES'!F32)","v":""},{"$f":"IF('LISTE ENGAGES'!G32=\"\",\"\",'LISTE ENGAGES'!G32)","v":""},{"$f":"IF('LISTE ENGAGES'!H32=\"\",\"\",'LISTE ENGAGES'!H32)","v":""},{"$f":"IF('LISTE ENGAGES'!I32=\"\",\"\",'LISTE ENGAGES'!I32)","v":""},{"$f":"IF('LISTE ENGAGES'!J32=\"\",\"\",'LISTE ENGAGES'!J32)","v":""}]
[null,null,{"$f":"IF('LISTE ENGAGES'!C33=\"\",\"\",'LISTE ENGAGES'!C33)","v":""},{"$f":"IF('LISTE ENGAGES'!D33=\"\",\"\",'LISTE ENGAGES'!D33)","v":""},{"$f":"IF('LISTE ENGAGES'!E33=\"\",\"\",'LISTE ENGAGES'!E33)","v":""},{"$f":"IF('LISTE ENGAGES'!F33=\"\",\"\",'LISTE ENGAGES'!F33)","v":""},{"$f":"IF('LISTE ENGAGES'!G33=\"\",\"\",'LISTE ENGAGES'!G33)","v":""},{"$f":"IF('LISTE ENGAGES'!H33=\"\",\"\",'LISTE ENGAGES'!H33)","v":""},{"$f":"IF('LISTE ENGAGES'!I33=\"\",\"\",'LISTE ENGAGES'!I33)","v":""},{"$f":"IF('LISTE ENGAGES'!J33=\"\",\"\",'LISTE ENGAGES'!J33)","v":""}]
[null,null,{"$f":"IF('LISTE ENGAGES'!C34=\"\",\"\",'LISTE ENGAGES'!C34)","v":""},{"$f":"IF('LISTE ENGAGES'!D34=\"\",\"\",'LISTE ENGAGES'!D34)","v":""},{"$f":"IF('LISTE ENGAGES'!E34=\"\",\"\",'LISTE ENGAGES'!E34)","v":""},{"$f":"IF('LISTE ENGAGES'!F34=\"\",\"\",'LISTE ENGAGES'!F34)","v":""},{"$f":"IF('LISTE ENGAGES'!G34=\"\",\"\",'LISTE ENGAGES'!G34)","v":""},{"$f":"IF('LISTE ENGAGES'!H34=\"\",\"\",'LISTE ENGAGES'!H34)","v":""},{"$f":"IF('LISTE ENGAGES'!I34=\"\",\"\",'LISTE ENGAGES'!I34)","v":""},{"$f":"IF('LISTE ENGAGES'!J34=\"\",\"\",'LISTE ENGAGES'!J34)","v":""}]
[]
[]
[]
[]
[]
[]
[]
[]
[null,null,"REMARQUES :"]
[]
[]
[]
[]
[]
[]
[]
[]
[null,null,"SIGNATURES :"]