{"text_format":"1","workbook":"xlsx","n_sheets":10,"sheets":["LISTES","LISTE ENGAGES","EMARG M Tableau QUALIF","SCORE QUALIF","Poule QUALIF 16 P+B","EMARG M Tableau PRIN","PLANNING PS 16","SCORE 16 PRINC","Poule 16 PS","RELEVE"],"not_rendered":{"charts":0,"images":7,"macros":1,"external_links":0,"defined_names":42,"comments":0,"pivot_tables":0},"unopened":[],"bounds":{"document_bytes":16777216,"sheet_cells":100000,"rows_first":2000,"rows_last":500,"rows_between":2000,"halvings":0,"cell_chars":16384,"cell_head_chars":4096},"cells_cut":0,"cells_raw":0,"read":"whole","date_system":"1900"}

{"sheet":"LISTES","index":0,"n_rows":66,"n_cols":19,"rows_kept":66,"cut":false,"hidden":true,"merged":[]}
[]
[]
[]
[]
[]
[]
[null,null,"CHAMPIONNAT DE France",null,2020,null,"MASCULIN","ABS",1,6.9444000000000005E-4,null,null,null,null,12,0.5,null,null,"12h"]
[null,null,"SERIE 1 - 2500",null,2021,null,"FEMININ",1,2,{"$f":"J7*I8","v":1.3888800000000001E-3},null,null,null,null,{"$f":"O7/2","v":6},{"$f":"P7/2","v":0.25},null,null,"6h"]
[null,null,"SERIE 1 - 2000",null,2022,null,"MIXTE",2,3,6.9444000000000005E-4,null,null,null,null,{"$f":"O8/2","v":3},0.125,null,null,"3h"]
[null,null,"SERIE 1 - 1500",null,2023,null,null,3,4,{"$f":"J9*I10","v":2.7777600000000002E-3},null,null,null,null,1,{"$f":"P9/3","v":4.1666666666666664E-2},null,null,"1h"]
[null,null,"SERIE 2 - 1000",null,2024,null,null,4,5,6.9444000000000005E-4,null,null,null,null,0.5,{"$f":"P10/2","v":2.0833333333333332E-2},null,null,"30mn"]
[null,null,"SERIE 2 - 750",null,null,null,null,5,6,{"$f":"J11*I12","v":4.1666400000000001E-3},null,null,null,null,{"$f":"O9/2","v":1.5},{"$f":"P9/2","v":6.25E-2},null,null,"1,30 h"]
[null,null,"SERIE 2 - 500",null,null,null,null,6,7,6.9444000000000005E-4,null,null,null,null,{"$f":"O12/2","v":0.75},3.125E-2,null,null,"45mn"]
[null,null,"SERIE 2 - 250",null,null,null,null,7,8,{"$f":"J13*I14","v":5.5555200000000004E-3},null,null,null,null,{"$f":"O13/2","v":0.375},1.5625E-2,null,null,"22mn"]
[null,null,"SERIE 3 - 150",null,null,null,null,8,9,6.9444000000000005E-4,null,null,null,null,null,{"$f":"P10/60","v":6.9444444444444436E-4},null,null,"1mn"]
[null,null,"SERIE 3 - 100",null,null,null,null,9,10,{"$f":"J15*I16","v":6.9444000000000007E-3},null,null,null,null,null,{"$f":"P15*50","v":3.4722222222222217E-2},null,null,"50mn"]
[null,null,null,null,null,null,null,10,11,6.9444000000000005E-4]
[null,null,null,null,null,null,null,11,12,{"$f":"J17*I18","v":8.3332800000000002E-3}]
[null,null,null,null,null,null,null,12,13,6.9444000000000005E-4]
[null,null,null,null,null,null,null,13,14,{"$f":"J19*I20","v":9.7221600000000005E-3}]
[null,null,null,null,null,null,null,14,15,6.9444000000000005E-4]
[null,null,null,null,null,null,null,15,16,{"$f":"J21*I22","v":1.1111040000000001E-2}]
[null,null,null,null,null,null,null,16,17,6.9444000000000005E-4]
[null,null,null,null,null,null,null,17,18,{"$f":"J23*I24","v":1.2499920000000001E-2}]
[null,null,null,null,null,null,null,18,19,6.9444000000000005E-4]
[null,null,null,null,null,null,null,19,20,{"$f":"J25*I26","v":1.3888800000000001E-2}]
[null,null,null,null,null,null,null,20,21,6.9444000000000005E-4]
[null,null,null,null,null,null,null,21,22,{"$f":"J27*I28","v":1.5277680000000002E-2}]
[null,null,null,null,null,null,null,22,23,6.9444000000000005E-4]
[null,null,null,null,null,null,null,23,24,{"$f":"J29*I30","v":1.666656E-2}]
[null,null,null,null,null,null,null,24,25,6.9444000000000005E-4]
[null,null,null,null,null,null,null,25,26,{"$f":"J31*I32","v":1.8055440000000002E-2}]
[null,null,null,null,null,null,null,26,27,6.9444000000000005E-4]
[null,null,null,null,null,null,null,27,28,{"$f":"J33*I34","v":1.9444320000000001E-2}]
[null,null,null,null,null,null,null,28,29,6.9444000000000005E-4]
[null,null,null,null,null,null,null,29,30,{"$f":"J35*I36","v":2.0833200000000003E-2}]
[null,null,null,null,null,null,null,30,31,6.9444000000000005E-4]
[null,null,null,null,null,null,null,31,32,{"$f":"J37*I38","v":2.2222080000000002E-2}]
[null,null,null,null,null,null,null,32,33,6.9444000000000005E-4]
[null,null,null,null,null,null,null,null,34,{"$f":"J39*I40","v":2.361096E-2}]
[null,null,null,null,null,null,null,null,35,6.9444000000000005E-4]
[null,null,null,null,null,null,null,null,36,{"$f":"J41*I42","v":2.4999840000000002E-2}]
[null,null,null,null,null,null,null,null,37,6.9444000000000005E-4]
[null,null,null,null,null,null,null,null,38,{"$f":"J43*I44","v":2.6388720000000001E-2}]
[null,null,null,null,null,null,null,null,39,6.9444000000000005E-4]
[null,null,null,null,null,null,null,null,40,{"$f":"J45*I46","v":2.7777600000000003E-2}]
[null,null,null,null,null,null,null,null,41,6.9444000000000005E-4]
[null,null,null,null,null,null,null,null,42,{"$f":"J47*I48","v":2.9166480000000002E-2}]
[null,null,null,null,null,null,null,null,43,6.9444000000000005E-4]
[null,null,null,null,null,null,null,null,44,{"$f":"J49*I50","v":3.0555360000000004E-2}]
[null,null,null,null,null,null,null,null,45,6.9444000000000005E-4]
[null,null,null,null,null,null,null,null,46,{"$f":"J51*I52","v":3.1944240000000006E-2}]
[null,null,null,null,null,null,null,null,47,6.9444000000000005E-4]
[null,null,null,null,null,null,null,null,48,{"$f":"J53*I54","v":3.3333120000000001E-2}]
[null,null,null,null,null,null,null,null,49,6.9444000000000005E-4]
[null,null,null,null,null,null,null,null,50,{"$f":"J55*I56","v":3.4722000000000003E-2}]
[null,null,null,null,null,null,null,null,51,6.9444000000000005E-4]
[null,null,null,null,null,null,null,null,52,{"$f":"J57*I58","v":3.6110880000000005E-2}]
[null,null,null,null,null,null,null,null,53,6.9444000000000005E-4]
[null,null,null,null,null,null,null,null,54,{"$f":"J59*I60","v":3.749976E-2}]
[null,null,null,null,null,null,null,null,55,6.9444000000000005E-4]
[null,null,null,null,null,null,null,null,56,{"$f":"J61*I62","v":3.8888640000000002E-2}]
[null,null,null,null,null,null,null,null,57,6.9444000000000005E-4]
[null,null,null,null,null,null,null,null,58,{"$f":"J63*I64","v":4.0277520000000004E-2}]
[null,null,null,null,null,null,null,null,59,6.9444000000000005E-4]
[null,null,null,null,null,null,null,null,60,{"$f":"J65*I66","v":4.1666400000000006E-2}]

{"sheet":"LISTE ENGAGES","index":1,"n_rows":34,"n_cols":17,"rows_kept":34,"cut":false,"hidden":false,"merged":[[12,13,12,17],[0,2,2,6],[0,7,2,7],[4,2,4,7],[5,2,5,7],[11,13,11,17],[3,2,3,4],[3,5,3,6]]}
[null,null,{"$f":"IF(Q3<>\"\",Q3,P3)","v":"APPELATION TOURNOI"},null,null,null,null,{"$f":"IF(Q10=\"\",P10,Q10)","v":"ORGANISATEUR"}]
[null,null,null,null,null,null,null,null,null,null,null,null,null,null,null,null,"IDENTITE DU TOURNOI"]
[null,null,null,null,null,null,null,null,null,null,null,null,null,null,null,"APPELATION TOURNOI"]
[null,null,{"$f":"IF(Q4<>\"\",Q4,P4)","v":"LIEU"},null,null,{"$f":"IF(Q6=\"\",\"DATE\",CONCATENATE(Q7,\"-\",Q8,\"/\",Q6))","v":"DATE"},null,{"$f":"IF(Q9=\"\",P9,Q9)","v":"GENRE"},null,null,null,null,null,null,null,"LIEU"]
[null,null,{"$f":"IF(Q5<>\"\",Q5,P5)","v":"TYPE"},null,null,null,null,null,null,null,null,null,null,null,null,"TYPE"]
[null,null,"LISTE EQUIPES ENGAGEES",null,null,null,null,null,null,null,null,null,null,null,null,"ANNEE"]
[null,null,null,null,null,null,null,null,null,null,null,null,null,null,null,"DATE DEBUT"]
["N°",null,"NOM","PRENOM","LICENCE","CLUB","NOM J2","PRENOM J2","LICENCE J2","CLUB J2","pts","tir",null,null,null,"DATE FIN"]
[1,null,null,null,null,null,null,null,null,null,null,null,null,null,null,"GENRE"]
[2,null,null,null,null,null,null,null,null,null,null,null,null,null,null,"ORGANISATEUR"]
[3]
[4,null,null,null,null,null,null,null,null,null,null,null,null,"1- Commencez par renseigner le tableau ci-dessus \"identité du tournoi\""]
[5,null,null,null,null,null,null,null,null,null,null,null,null,"2- Copiez-collez la liste des équipes engagées dans les champs ci-contre en respectant : "]
[6,null,null,null,null,null,null,null,null,null,null,null,null,"- nom et premon séparés pour chaque joueur ( à défaut, ne mentionez que le nom)"]
[7,null,null,null,null,null,null,null,null,null,null,null,null,"- l'ordre décroissant des têtes de séries"]
[8,null,null,null,null,null,null,null,null,null,null,null,null,"3- Renseignez l'onglet \"EMARG….\" selon l'avancée dans les tableaux"]
[9,null,null,null,null,null,null,null,null,null,null,null,null,"4-Renseignez les scores des rencontres dans l'onglet \" TAB…\" en fonction de l'avancée du tableau"]
[10,null,null,null,null,null,null,null,null,null,null,null,null,"5- Renseignez l'onglet \"RELEVE\" à l'issue de la compétition"]
[11]
[12]
[13]
[14]
[15]
[16]
[17]
[18]
[19]
[20]
[21]
[22]
[23]
[24]
[25]
[26]

{"sheet":"EMARG M Tableau QUALIF","index":2,"n_rows":29,"n_cols":15,"rows_kept":29,"cut":false,"hidden":false,"merged":[[5,3,5,13],[1,3,2,12],[1,13,3,13],[3,3,3,6],[3,7,3,11],[4,3,4,13]]}
[]
[null,null,null,{"$f":"IF('LISTE ENGAGES'!Q3=\"\",'LISTE ENGAGES'!P3,'LISTE ENGAGES'!Q3)","v":"APPELATION TOURNOI"},null,null,null,null,null,null,null,null,null,{"$f":"'LISTE ENGAGES'!H1:H3","v":0}]
[]
[null,null,null,{"$f":"IF('LISTE ENGAGES'!Q4=\"\",'LISTE ENGAGES'!P4,'LISTE ENGAGES'!Q4)","v":"LIEU"},null,null,null,{"$f":"'LISTE ENGAGES'!F4","v":"DATE"},null,null,null,null,{"$f":"'LISTE ENGAGES'!H4","v":"GENRE"}]
[null,null,null,{"$f":"IF('LISTE ENGAGES'!Q5<>\"\",'LISTE ENGAGES'!Q5,'LISTE ENGAGES'!P5)","v":"TYPE"}]
[null,null,null,"FEUILLE EMARGEMENT"]
[]
["N°",null,"NOM","PRENOM","LICENCE","CLUB","NOM","PRENOM","LICENCE","CLUB","pts","tir","SIGNATURE JOUEUR1","SIGNATURE JOUEUR2","Rglt"]
[1,null,"T",null,null,null,1]
[2,null,"T",null,null,null,2]
[3,null,"T",null,null,null,3]
[4,null,"T",null,null,null,4]
[5,null,"T",null,null,null,5]
[6,null,"T",null,null,null,6]
[7,null,"T",null,null,null,7]
[8,null,"T",null,null,null,8]
[9,null,"T",null,null,null,9]
[10,null,"T",null,null,null,10]
[11,null,"T",null,null,null,11]
[12,null,"T",null,null,null,12]
[13,null,"T",null,null,null,13]
[14,null,"T",null,null,null,14]
[15,null,"T",null,null,null,15]
[16,null,"T",null,null,null,16]
[]
[null,null,"Copier/coller selon LISTE ENGAGES en fonction des équipes confirmées APRES les qualifications"]
[null,null,"ATTENTION : Respecter l'ordre des têtes de séries en fonction des points et classement de la LISTE ENGAGES"]
[null,null,"Ex: Si Sur LISTE ENGAGES, l'équipe 9 absente, la numéro 10 devient la numéro 9 dans EMARG"]
[null,null,"EX: Si toutes les equipes du tableau principal sont confirmées, les équipes issues qualifications sont replacées en fonction de leurs points, en bas de tableau"]

{"sheet":"SCORE QUALIF","index":3,"n_rows":43,"n_cols":34,"rows_kept":43,"cut":false,"hidden":true,"merged":[]}
[]
[]
["DEBUT J1","09:00:00"]
["TEMPS","00:30:00"]
["DEBUT J2","00:00:00"]
[]
[null,null,"PHASE","JOUR","N° MATCH","HEURE","TER","EQ1","EQ2","SCORE EQ1","SCORE EQ2","SET 1 EQ1","SET 1 EQ2","SET 2 EQ1","SET 2 EQ2","SET 3 EQ1","SET 3 EQ2","POS 1","POS 2",null,null,null,null,"PTS","S+","S-","P+","P-","CS","CP","CL.I","RG",null,"CLA"]
[null,null,"A",1,1,{"$f":"B3","v":"09:00:00"},1,{"$f":"'Poule QUALIF 16 P+B'!C14","v":"T / 1"},{"$f":"'Poule QUALIF 16 P+B'!C17","v":"T / 16"},{"$f":"SUM(IF(L8>M8,1,0),IF(N8>O8,1,0),IF(P8>Q8,1,0))","v":0},{"$f":"SUM(IF(M8>L8,1,0),IF(O8>N8,1,0),IF(Q8>P8,1,0))","v":0},{"$f":"'Poule QUALIF 16 P+B'!M13","v":0},{"$f":"'Poule QUALIF 16 P+B'!O13","v":0},{"$f":"'Poule QUALIF 16 P+B'!Q13","v":0},{"$f":"'Poule QUALIF 16 P+B'!S13","v":0},{"$f":"'Poule QUALIF 16 P+B'!U13","v":0},{"$f":"'Poule QUALIF 16 P+B'!W13","v":0},{"$f":"IF(J8=K8,\"\",IF(J8>K8,H8,I8))","v":""},{"$f":"IF(J8=K8,\"\",IF(J8<K8,H8,I8))","v":""},null,null,null,{"$f":"'Poule QUALIF 16 P+B'!C14","v":"T / 1"},{"$f":"COUNTIF(PLACE1,W8)*2+COUNTIF(PLACE2,W8)","v":0},{"$f":"SUMIF(LISTEE1,W8,(SCEQ1))+SUMIF(LISTEE2,W8,(SCEQ2))","v":0},{"$f":"SUMIF(LISTEE1,W8,(SCEQ2))+SUMIF(LISTEE2,W8,(SCEQ1))","v":0},{"$f":"(SUMPRODUCT((LISTEE1=W8)*((S1EQ1)+(S2EQ1)+(S3EQ1))))+(SUMPRODUCT((LISTEE2=W8)*((S1EQ2)+(S2EQ2)+(S3EQ3))))","v":0},{"$f":"(SUMPRODUCT((LISTEE2=W8)*((S1EQ1)+(S2EQ1)+(S3EQ1))))+(SUMPRODUCT((LISTEE1=W8)*((S1EQ2)+(S2EQ2)+(S3EQ3))))","v":0},{"$f":"IFERROR(Y8/Z8,0)","v":0},{"$f":"IFERROR(AA8/AB8,0)","v":0},{"$f":"X8+AC8/100+AD8/100","v":0},{"$f":"IF(X8=0,\"\",RANK(AE8,$AE$8:$AE$11))","v":""},1,{"$f":"IF(X8=0,\"\",IF($AF$8=AG8,$W$8,IF($AF$9=AG8,$W$9,IF($AF$10=AG8,$W$10,IF($AF$11=AG8,$W$11)))))","v":""}]
[null,null,"B",1,2,{"$f":"B3","v":"09:00:00"},2,{"$f":"'Poule QUALIF 16 P+B'!C21","v":"T / 2"},{"$f":"'Poule QUALIF 16 P+B'!C24","v":"T / 15"},0,0,{"$f":"'Poule QUALIF 16 P+B'!M20","v":0},{"$f":"'Poule QUALIF 16 P+B'!O20","v":0},{"$f":"'Poule QUALIF 16 P+B'!Q20","v":0},{"$f":"'Poule QUALIF 16 P+B'!S20","v":0},{"$f":"'Poule QUALIF 16 P+B'!U20","v":0},{"$f":"'Poule QUALIF 16 P+B'!W20","v":0},{"$f":"IF(J9=K9,\"\",IF(J9>K9,H9,I9))","v":""},{"$f":"IF(J9=K9,\"\",IF(J9<K9,H9,I9))","v":""},null,null,null,{"$f":"'Poule QUALIF 16 P+B'!C15","v":"T / 8"},{"$f":"COUNTIF(PLACE1,W9)*2+COUNTIF(PLACE2,W9)","v":0},{"$f":"SUMIF(LISTEE1,W9,(SCEQ1))+SUMIF(LISTEE2,W9,(SCEQ2))","v":0},{"$f":"SUMIF(LISTEE1,W9,(SCEQ2))+SUMIF(LISTEE2,W9,(SCEQ1))","v":0},{"$f":"(SUMPRODUCT((LISTEE1=W9)*((S1EQ1)+(S2EQ1)+(S3EQ1))))+(SUMPRODUCT((LISTEE2=W9)*((S1EQ2)+(S2EQ2)+(S3EQ3))))","v":0},{"$f":"(SUMPRODUCT((LISTEE2=W9)*((S1EQ1)+(S2EQ1)+(S3EQ1))))+(SUMPRODUCT((LISTEE1=W9)*((S1EQ2)+(S2EQ2)+(S3EQ3))))","v":0},{"$f":"IFERROR(Y9/Z9,0)","v":0},{"$f":"IFERROR(AA9/AB9,0)","v":0},{"$f":"X9+AC9/100+AD9/100","v":0},{"$f":"IF(X9=0,\"\",RANK(AE9,$AE$8:$AE$11))","v":""},2,{"$f":"IF(X9=0,\"\",IF($AF$8=AG9,$W$8,IF($AF$9=AG9,$W$9,IF($AF$10=AG9,$W$10,IF($AF$11=AG9,$W$11)))))","v":""}]
[null,null,"C",1,3,{"$f":"F8+$B$4","v":"09:30:00"},1,{"$f":"'Poule QUALIF 16 P+B'!C28","v":"T / 3"},{"$f":"'Poule QUALIF 16 P+B'!C31","v":"T / 14"},0,0,{"$f":"'Poule QUALIF 16 P+B'!M27","v":0},{"$f":"'Poule QUALIF 16 P+B'!O27","v":0},{"$f":"'Poule QUALIF 16 P+B'!Q27","v":0},{"$f":"'Poule QUALIF 16 P+B'!S27","v":0},{"$f":"'Poule QUALIF 16 P+B'!U27","v":0},{"$f":"'Poule QUALIF 16 P+B'!W27","v":0},"","",null,null,null,{"$f":"'Poule QUALIF 16 P+B'!C16","v":"T / 9"},{"$f":"COUNTIF(PLACE1,W10)*2+COUNTIF(PLACE2,W10)","v":0},{"$f":"SUMIF(LISTEE1,W10,(SCEQ1))+SUMIF(LISTEE2,W10,(SCEQ2))","v":0},{"$f":"SUMIF(LISTEE1,W10,SCEQ2)+SUMIF(LISTEE2,W10,SCEQ1)","v":0},{"$f":"(SUMPRODUCT((LISTEE1=W10)*((S1EQ1)+(S2EQ1)+(S3EQ1))))+(SUMPRODUCT((LISTEE2=W10)*((S1EQ2)+(S2EQ2)+(S3EQ3))))","v":0},{"$f":"(SUMPRODUCT((LISTEE2=W10)*((S1EQ1)+(S2EQ1)+(S3EQ1))))+(SUMPRODUCT((LISTEE1=W10)*((S1EQ2)+(S2EQ2)+(S3EQ3))))","v":0},0,0,0,{"$f":"IF(X10=0,\"\",RANK(AE10,$AE$8:$AE$11))","v":""},3,{"$f":"IF(X10=0,\"\",IF($AF$8=AG10,$W$8,IF($AF$9=AG10,$W$9,IF($AF$10=AG10,$W$10,IF($AF$11=AG10,$W$11)))))","v":""}]
[null,null,"D",1,4,"09:30:00",2,{"$f":"'Poule QUALIF 16 P+B'!C35","v":"T / 4"},{"$f":"'Poule QUALIF 16 P+B'!C38","v":"T / 13"},0,0,{"$f":"'Poule QUALIF 16 P+B'!M34","v":0},{"$f":"'Poule QUALIF 16 P+B'!O34","v":0},{"$f":"'Poule QUALIF 16 P+B'!Q34","v":0},{"$f":"'Poule QUALIF 16 P+B'!S34","v":0},{"$f":"'Poule QUALIF 16 P+B'!U34","v":0},{"$f":"'Poule QUALIF 16 P+B'!W34","v":0},"","",null,null,null,{"$f":"'Poule QUALIF 16 P+B'!C17","v":"T / 16"},{"$f":"COUNTIF(PLACE1,W11)*2+COUNTIF(PLACE2,W11)","v":0},{"$f":"SUMIF(LISTEE1,W11,(SCEQ1))+SUMIF(LISTEE2,W11,(SCEQ2))","v":0},{"$f":"SUMIF(LISTEE1,W11,SCEQ2)+SUMIF(LISTEE2,W11,SCEQ1)","v":0},{"$f":"(SUMPRODUCT((LISTEE1=W11)*((S1EQ1)+(S2EQ1)+(S3EQ1))))+(SUMPRODUCT((LISTEE2=W11)*((S1EQ2)+(S2EQ2)+(S3EQ3))))","v":0},{"$f":"(SUMPRODUCT((LISTEE2=W11)*((S1EQ1)+(S2EQ1)+(S3EQ1))))+(SUMPRODUCT((LISTEE1=W11)*((S1EQ2)+(S2EQ2)+(S3EQ3))))","v":0},0,0,0,{"$f":"IF(X11=0,\"\",RANK(AE11,$AE$8:$AE$11))","v":""},4,{"$f":"IF(X11=0,\"\",IF($AF$8=AG11,$W$8,IF($AF$9=AG11,$W$9,IF($AF$10=AG11,$W$10,IF($AF$11=AG11,$W$11)))))","v":""}]
[null,null,"A",1,5,"10:00:00",1,{"$f":"'Poule QUALIF 16 P+B'!C15","v":"T / 8"},{"$f":"'Poule QUALIF 16 P+B'!C16","v":"T / 9"},0,0,{"$f":"'Poule QUALIF 16 P+B'!M14","v":0},{"$f":"'Poule QUALIF 16 P+B'!O14","v":0},{"$f":"'Poule QUALIF 16 P+B'!Q14","v":0},{"$f":"'Poule QUALIF 16 P+B'!S14","v":0},{"$f":"'Poule QUALIF 16 P+B'!U14","v":0},{"$f":"'Poule QUALIF 16 P+B'!W14","v":0},"",""]
[null,null,"B",1,6,"10:00:00",2,{"$f":"'Poule QUALIF 16 P+B'!C22","v":"T / 7"},{"$f":"'Poule QUALIF 16 P+B'!C23","v":"T / 10"},0,0,{"$f":"'Poule QUALIF 16 P+B'!M21","v":0},{"$f":"'Poule QUALIF 16 P+B'!O21","v":0},{"$f":"'Poule QUALIF 16 P+B'!Q21","v":0},{"$f":"'Poule QUALIF 16 P+B'!S21","v":0},{"$f":"'Poule QUALIF 16 P+B'!U21","v":0},{"$f":"'Poule QUALIF 16 P+B'!W21","v":0},"","",null,null,null,{"$f":"'Poule QUALIF 16 P+B'!C21","v":"T / 2"},{"$f":"COUNTIF(PLACE1,W13)*2+COUNTIF(PLACE2,W13)","v":0},{"$f":"SUMIF(LISTEE1,W13,(SCEQ1))+SUMIF(LISTEE2,W13,(SCEQ2))","v":0},{"$f":"SUMIF(LISTEE1,W13,SCEQ2)+SUMIF(LISTEE2,W13,SCEQ1)","v":0},{"$f":"(SUMPRODUCT((LISTEE1=W13)*((S1EQ1)+(S2EQ1)+(S3EQ1))))+(SUMPRODUCT((LISTEE2=W13)*((S1EQ2)+(S2EQ2)+(S3EQ3))))","v":0},{"$f":"(SUMPRODUCT((LISTEE2=W13)*((S1EQ1)+(S2EQ1)+(S3EQ1))))+(SUMPRODUCT((LISTEE1=W13)*((S1EQ2)+(S2EQ2)+(S3EQ3))))","v":0},0,0,0,{"$f":"IF(X13=0,\"\",RANK(AE13,$AE$13:$AE$16))","v":""},1,{"$f":"IF(X13=0,\"\",IF($AF$13=AG13,$W$13,IF($AF$14=AG13,$W$14,IF($AF$15=AG13,$W$15,IF($AF$16=AG13,$W$16)))))","v":""}]
[null,null,"C",1,7,"10:30:00",1,{"$f":"'Poule QUALIF 16 P+B'!C29","v":"T / 6"},{"$f":"'Poule QUALIF 16 P+B'!C30","v":"T / 11"},0,0,{"$f":"'Poule QUALIF 16 P+B'!M28","v":0},{"$f":"'Poule QUALIF 16 P+B'!O28","v":0},{"$f":"'Poule QUALIF 16 P+B'!Q28","v":0},{"$f":"'Poule QUALIF 16 P+B'!S28","v":0},{"$f":"'Poule QUALIF 16 P+B'!U28","v":0},{"$f":"'Poule QUALIF 16 P+B'!W28","v":0},{"$f":"IF(J14=K14,\"\",IF(J14>K14,H14,I14))","v":""},"",null,null,null,{"$f":"'Poule QUALIF 16 P+B'!C22","v":"T / 7"},{"$f":"COUNTIF(PLACE1,W14)*2+COUNTIF(PLACE2,W14)","v":0},{"$f":"SUMIF(LISTEE1,W14,(SCEQ1))+SUMIF(LISTEE2,W14,(SCEQ2))","v":0},{"$f":"SUMIF(LISTEE1,W14,SCEQ2)+SUMIF(LISTEE2,W14,SCEQ1)","v":0},{"$f":"(SUMPRODUCT((LISTEE1=W14)*((S1EQ1)+(S2EQ1)+(S3EQ1))))+(SUMPRODUCT((LISTEE2=W14)*((S1EQ2)+(S2EQ2)+(S3EQ3))))","v":0},{"$f":"(SUMPRODUCT((LISTEE2=W14)*((S1EQ1)+(S2EQ1)+(S3EQ1))))+(SUMPRODUCT((LISTEE1=W14)*((S1EQ2)+(S2EQ2)+(S3EQ3))))","v":0},0,0,0,{"$f":"IF(X14=0,\"\",RANK(AE14,$AE$13:$AE$16))","v":""},2,{"$f":"IF(X14=0,\"\",IF($AF$13=AG14,$W$13,IF($AF$14=AG14,$W$14,IF($AF$15=AG14,$W$15,IF($AF$16=AG14,$W$16)))))","v":""}]
[null,null,"D",1,8,"10:30:00",2,{"$f":"'Poule QUALIF 16 P+B'!C36","v":"T / 5"},{"$f":"'Poule QUALIF 16 P+B'!C37","v":"T /12"},0,0,{"$f":"'Poule QUALIF 16 P+B'!M35","v":0},{"$f":"'Poule QUALIF 16 P+B'!O35","v":0},{"$f":"'Poule QUALIF 16 P+B'!Q35","v":0},{"$f":"'Poule QUALIF 16 P+B'!S35","v":0},{"$f":"'Poule QUALIF 16 P+B'!U35","v":0},{"$f":"'Poule QUALIF 16 P+B'!W35","v":0},"","",null,null,null,{"$f":"'Poule QUALIF 16 P+B'!C23","v":"T / 10"},{"$f":"COUNTIF(PLACE1,W15)*2+COUNTIF(PLACE2,W15)","v":0},{"$f":"SUMIF(LISTEE1,W15,(SCEQ1))+SUMIF(LISTEE2,W15,(SCEQ2))","v":0},{"$f":"SUMIF(LISTEE1,W15,SCEQ2)+SUMIF(LISTEE2,W15,SCEQ1)","v":0},{"$f":"(SUMPRODUCT((LISTEE1=W15)*((S1EQ1)+(S2EQ1)+(S3EQ1))))+(SUMPRODUCT((LISTEE2=W15)*((S1EQ2)+(S2EQ2)+(S3EQ3))))","v":0},{"$f":"(SUMPRODUCT((LISTEE2=W15)*((S1EQ1)+(S2EQ1)+(S3EQ1))))+(SUMPRODUCT((LISTEE1=W15)*((S1EQ2)+(S2EQ2)+(S3EQ3))))","v":0},0,0,0,{"$f":"IF(X15=0,\"\",RANK(AE15,$AE$13:$AE$16))","v":""},3,{"$f":"IF(X15=0,\"\",IF($AF$13=AG15,$W$13,IF($AF$14=AG15,$W$14,IF($AF$15=AG15,$W$15,IF($AF$16=AG15,$W$16)))))","v":""}]
[null,null,"A",1,9,"11:00:00",1,{"$f":"'Poule QUALIF 16 P+B'!C15","v":"T / 8"},{"$f":"'Poule QUALIF 16 P+B'!C17","v":"T / 16"},0,0,{"$f":"'Poule QUALIF 16 P+B'!M15","v":0},{"$f":"'Poule QUALIF 16 P+B'!O15","v":0},{"$f":"'Poule QUALIF 16 P+B'!Q15","v":0},{"$f":"'Poule QUALIF 16 P+B'!S15","v":0},{"$f":"'Poule QUALIF 16 P+B'!U15","v":0},{"$f":"'Poule QUALIF 16 P+B'!W15","v":0},"","",null,null,null,{"$f":"'Poule QUALIF 16 P+B'!C24","v":"T / 15"},{"$f":"COUNTIF(PLACE1,W16)*2+COUNTIF(PLACE2,W16)","v":0},{"$f":"SUMIF(LISTEE1,W16,(SCEQ1))+SUMIF(LISTEE2,W16,(SCEQ2))","v":0},{"$f":"SUMIF(LISTEE1,W16,SCEQ2)+SUMIF(LISTEE2,W16,SCEQ1)","v":0},{"$f":"(SUMPRODUCT((LISTEE1=W16)*((S1EQ1)+(S2EQ1)+(S3EQ1))))+(SUMPRODUCT((LISTEE2=W16)*((S1EQ2)+(S2EQ2)+(S3EQ3))))","v":0},{"$f":"(SUMPRODUCT((LISTEE2=W16)*((S1EQ1)+(S2EQ1)+(S3EQ1))))+(SUMPRODUCT((LISTEE1=W16)*((S1EQ2)+(S2EQ2)+(S3EQ3))))","v":0},0,0,0,{"$f":"IF(X16=0,\"\",RANK(AE16,$AE$13:$AE$16))","v":""},4,{"$f":"IF(X16=0,\"\",IF($AF$13=AG16,$W$13,IF($AF$14=AG16,$W$14,IF($AF$15=AG16,$W$15,IF($AF$16=AG16,$W$16)))))","v":""}]
[null,null,"B",1,10,"11:00:00",2,{"$f":"'Poule QUALIF 16 P+B'!C22","v":"T / 7"},{"$f":"'Poule QUALIF 16 P+B'!C24","v":"T / 15"},0,0,{"$f":"'Poule QUALIF 16 P+B'!M22","v":0},{"$f":"'Poule QUALIF 16 P+B'!O22","v":0},{"$f":"'Poule QUALIF 16 P+B'!Q22","v":0},{"$f":"'Poule QUALIF 16 P+B'!S22","v":0},{"$f":"'Poule QUALIF 16 P+B'!U22","v":0},{"$f":"'Poule QUALIF 16 P+B'!W22","v":0},"",""]
[null,null,"C",1,11,"11:30:00",1,{"$f":"'Poule QUALIF 16 P+B'!C29","v":"T / 6"},{"$f":"'Poule QUALIF 16 P+B'!C31","v":"T / 14"},0,0,{"$f":"'Poule QUALIF 16 P+B'!M29","v":0},{"$f":"'Poule QUALIF 16 P+B'!O29","v":0},{"$f":"'Poule QUALIF 16 P+B'!Q29","v":0},{"$f":"'Poule QUALIF 16 P+B'!S29","v":0},{"$f":"'Poule QUALIF 16 P+B'!U29","v":0},{"$f":"'Poule QUALIF 16 P+B'!W29","v":0},"","",null,null,null,{"$f":"'Poule QUALIF 16 P+B'!C28","v":"T / 3"},{"$f":"COUNTIF(PLACE1,W18)*2+COUNTIF(PLACE2,W18)","v":0},{"$f":"SUMIF(LISTEE1,W18,(SCEQ1))+SUMIF(LISTEE2,W18,(SCEQ2))","v":0},{"$f":"SUMIF(LISTEE1,W18,SCEQ2)+SUMIF(LISTEE2,W18,SCEQ1)","v":0},{"$f":"(SUMPRODUCT((LISTEE1=W18)*((S1EQ1)+(S2EQ1)+(S3EQ1))))+(SUMPRODUCT((LISTEE2=W18)*((S1EQ2)+(S2EQ2)+(S3EQ3))))","v":0},{"$f":"(SUMPRODUCT((LISTEE2=W18)*((S1EQ1)+(S2EQ1)+(S3EQ1))))+(SUMPRODUCT((LISTEE1=W18)*((S1EQ2)+(S2EQ2)+(S3EQ3))))","v":0},{"$f":"IFERROR(Y18/Z18,0)","v":0},0,{"$f":"X18+AC18/100+AD18/100","v":0},{"$f":"IF(X18=0,\"\",RANK(AE18,$AE$18:$AE$21))","v":""},1,{"$f":"IF(X18=0,\"\",IF($AF$18=AG18,$W$18,IF($AF$19=AG18,$W$19,IF($AF$20=AG18,$W$20,IF($AF$21=AG18,$W$21)))))","v":""}]
[null,null,"D",1,12,"11:30:00",2,{"$f":"'Poule QUALIF 16 P+B'!C36","v":"T / 5"},{"$f":"'Poule QUALIF 16 P+B'!C38","v":"T / 13"},0,0,{"$f":"'Poule QUALIF 16 P+B'!M36","v":0},{"$f":"'Poule QUALIF 16 P+B'!O36","v":0},{"$f":"'Poule QUALIF 16 P+B'!Q36","v":0},{"$f":"'Poule QUALIF 16 P+B'!S36","v":0},{"$f":"'Poule QUALIF 16 P+B'!U36","v":0},{"$f":"'Poule QUALIF 16 P+B'!W36","v":0},"","",null,null,null,{"$f":"'Poule QUALIF 16 P+B'!C29","v":"T / 6"},{"$f":"COUNTIF(PLACE1,W19)*2+COUNTIF(PLACE2,W19)","v":0},{"$f":"SUMIF(LISTEE1,W19,(SCEQ1))+SUMIF(LISTEE2,W19,(SCEQ2))","v":0},{"$f":"SUMIF(LISTEE1,W19,SCEQ2)+SUMIF(LISTEE2,W19,SCEQ1)","v":0},{"$f":"(SUMPRODUCT((LISTEE1=W19)*((S1EQ1)+(S2EQ1)+(S3EQ1))))+(SUMPRODUCT((LISTEE2=W19)*((S1EQ2)+(S2EQ2)+(S3EQ3))))","v":0},{"$f":"(SUMPRODUCT((LISTEE2=W19)*((S1EQ1)+(S2EQ1)+(S3EQ1))))+(SUMPRODUCT((LISTEE1=W19)*((S1EQ2)+(S2EQ2)+(S3EQ3))))","v":0},0,0,{"$f":"X19+AC19/100+AD19/100","v":0},{"$f":"IF(X19=0,\"\",RANK(AE19,$AE$18:$AE$21))","v":""},2,{"$f":"IF(X19=0,\"\",IF($AF$18=AG19,$W$18,IF($AF$19=AG19,$W$19,IF($AF$20=AG19,$W$20,IF($AF$21=AG19,$W$21)))))","v":""}]
[null,null,"A",1,13,"12:00:00",1,{"$f":"'Poule QUALIF 16 P+B'!C14","v":"T / 1"},{"$f":"'Poule QUALIF 16 P+B'!C16","v":"T / 9"},0,0,{"$f":"'Poule QUALIF 16 P+B'!M16","v":0},{"$f":"'Poule QUALIF 16 P+B'!O16","v":0},{"$f":"'Poule QUALIF 16 P+B'!Q16","v":0},{"$f":"'Poule QUALIF 16 P+B'!S16","v":0},{"$f":"'Poule QUALIF 16 P+B'!U16","v":0},{"$f":"'Poule QUALIF 16 P+B'!W16","v":0},{"$f":"IF(J20=K20,\"\",IF(J20>K20,H20,I20))","v":""},{"$f":"IF(J20=K20,\"\",IF(J20<K20,H20,I20))","v":""},null,null,null,{"$f":"'Poule QUALIF 16 P+B'!C30","v":"T / 11"},{"$f":"COUNTIF(PLACE1,W20)*2+COUNTIF(PLACE2,W20)","v":0},{"$f":"SUMIF(LISTEE1,W20,(SCEQ1))+SUMIF(LISTEE2,W20,(SCEQ2))","v":0},{"$f":"SUMIF(LISTEE1,W20,SCEQ2)+SUMIF(LISTEE2,W20,SCEQ1)","v":0},{"$f":"(SUMPRODUCT((LISTEE1=W20)*((S1EQ1)+(S2EQ1)+(S3EQ1))))+(SUMPRODUCT((LISTEE2=W20)*((S1EQ2)+(S2EQ2)+(S3EQ3))))","v":0},{"$f":"(SUMPRODUCT((LISTEE2=W20)*((S1EQ1)+(S2EQ1)+(S3EQ1))))+(SUMPRODUCT((LISTEE1=W20)*((S1EQ2)+(S2EQ2)+(S3EQ3))))","v":0},0,0,0,"",3,{"$f":"IF(X20=0,\"\",IF($AF$18=AG20,$W$18,IF($AF$19=AG20,$W$19,IF($AF$20=AG20,$W$20,IF($AF$21=AG20,$W$21)))))","v":""}]
[null,null,"B",1,14,"12:00:00",2,{"$f":"'Poule QUALIF 16 P+B'!C21","v":"T / 2"},{"$f":"'Poule QUALIF 16 P+B'!C23","v":"T / 10"},0,0,{"$f":"'Poule QUALIF 16 P+B'!M23","v":0},{"$f":"'Poule QUALIF 16 P+B'!O23","v":0},{"$f":"'Poule QUALIF 16 P+B'!Q23","v":0},{"$f":"'Poule QUALIF 16 P+B'!S23","v":0},{"$f":"'Poule QUALIF 16 P+B'!U23","v":0},{"$f":"'Poule QUALIF 16 P+B'!W23","v":0},"","",null,null,null,{"$f":"'Poule QUALIF 16 P+B'!C31","v":"T / 14"},{"$f":"COUNTIF(PLACE1,W21)*2+COUNTIF(PLACE2,W21)","v":0},{"$f":"SUMIF(LISTEE1,W21,(SCEQ1))+SUMIF(LISTEE2,W21,(SCEQ2))","v":0},{"$f":"SUMIF(LISTEE1,W21,SCEQ2)+SUMIF(LISTEE2,W21,SCEQ1)","v":0},{"$f":"(SUMPRODUCT((LISTEE1=W21)*((S1EQ1)+(S2EQ1)+(S3EQ1))))+(SUMPRODUCT((LISTEE2=W21)*((S1EQ2)+(S2EQ2)+(S3EQ3))))","v":0},{"$f":"(SUMPRODUCT((LISTEE2=W21)*((S1EQ1)+(S2EQ1)+(S3EQ1))))+(SUMPRODUCT((LISTEE1=W21)*((S1EQ2)+(S2EQ2)+(S3EQ3))))","v":0},0,0,{"$f":"X21+AC21/100+AD21/100","v":0},"",4,{"$f":"IF(X21=0,\"\",IF($AF$18=AG21,$W$18,IF($AF$19=AG21,$W$19,IF($AF$20=AG21,$W$20,IF($AF$21=AG21,$W$21)))))","v":""}]
[null,null,"C",1,15,"12:30:00",1,{"$f":"'Poule QUALIF 16 P+B'!C28","v":"T / 3"},{"$f":"'Poule QUALIF 16 P+B'!C30","v":"T / 11"},0,0,{"$f":"'Poule QUALIF 16 P+B'!M30","v":0},{"$f":"'Poule QUALIF 16 P+B'!O30","v":0},{"$f":"'Poule QUALIF 16 P+B'!Q30","v":0},{"$f":"'Poule QUALIF 16 P+B'!S30","v":0},{"$f":"'Poule QUALIF 16 P+B'!U30","v":0},{"$f":"'Poule QUALIF 16 P+B'!W30","v":0},"",""]
[null,null,"D",1,16,"12:30:00",2,{"$f":"'Poule QUALIF 16 P+B'!C35","v":"T / 4"},{"$f":"'Poule QUALIF 16 P+B'!C37","v":"T /12"},0,0,{"$f":"'Poule QUALIF 16 P+B'!M37","v":0},{"$f":"'Poule QUALIF 16 P+B'!O37","v":0},{"$f":"'Poule QUALIF 16 P+B'!Q37","v":0},{"$f":"'Poule QUALIF 16 P+B'!S37","v":0},{"$f":"'Poule QUALIF 16 P+B'!U37","v":0},{"$f":"'Poule QUALIF 16 P+B'!W37","v":0},"","",null,null,null,{"$f":"'Poule QUALIF 16 P+B'!C35","v":"T / 4"},{"$f":"COUNTIF(PLACE1,W23)*2+COUNTIF(PLACE2,W23)","v":0},{"$f":"SUMIF(LISTEE1,W23,(SCEQ1))+SUMIF(LISTEE2,W23,(SCEQ2))","v":0},{"$f":"SUMIF(LISTEE1,W23,SCEQ2)+SUMIF(LISTEE2,W23,SCEQ1)","v":0},{"$f":"(SUMPRODUCT((LISTEE1=W23)*((S1EQ1)+(S2EQ1)+(S3EQ1))))+(SUMPRODUCT((LISTEE2=W23)*((S1EQ2)+(S2EQ2)+(S3EQ3))))","v":0},{"$f":"(SUMPRODUCT((LISTEE2=W23)*((S1EQ1)+(S2EQ1)+(S3EQ1))))+(SUMPRODUCT((LISTEE1=W23)*((S1EQ2)+(S2EQ2)+(S3EQ3))))","v":0},0,0,0,{"$f":"IF(X23=0,\"\",RANK(AE23,$AE$23:$AE$26))","v":""},1,{"$f":"IF(X23=0,\"\",IF($AF$23=AG23,$W$23,IF($AF$24=AG23,$W$24,IF($AF$25=AG23,$W$25,IF($AF$26=AG23,$W$26)))))","v":""}]
[null,null,"A",1,17,"13:00:00",1,{"$f":"'Poule QUALIF 16 P+B'!C16","v":"T / 9"},{"$f":"'Poule QUALIF 16 P+B'!C17","v":"T / 16"},0,0,{"$f":"'Poule QUALIF 16 P+B'!M17","v":0},{"$f":"'Poule QUALIF 16 P+B'!O17","v":0},{"$f":"'Poule QUALIF 16 P+B'!Q17","v":0},{"$f":"'Poule QUALIF 16 P+B'!S17","v":0},{"$f":"'Poule QUALIF 16 P+B'!U17","v":0},{"$f":"'Poule QUALIF 16 P+B'!W17","v":0},{"$f":"IF(J24=K24,\"\",IF(J24>K24,H24,I24))","v":""},{"$f":"IF(J24=K24,\"\",IF(J24<K24,H24,I24))","v":""},null,null,null,{"$f":"'Poule QUALIF 16 P+B'!C36","v":"T / 5"},{"$f":"COUNTIF(PLACE1,W24)*2+COUNTIF(PLACE2,W24)","v":0},{"$f":"SUMIF(LISTEE1,W24,(SCEQ1))+SUMIF(LISTEE2,W24,(SCEQ2))","v":0},{"$f":"SUMIF(LISTEE1,W24,SCEQ2)+SUMIF(LISTEE2,W24,SCEQ1)","v":0},{"$f":"(SUMPRODUCT((LISTEE1=W24)*((S1EQ1)+(S2EQ1)+(S3EQ1))))+(SUMPRODUCT((LISTEE2=W24)*((S1EQ2)+(S2EQ2)+(S3EQ3))))","v":0},{"$f":"(SUMPRODUCT((LISTEE2=W24)*((S1EQ1)+(S2EQ1)+(S3EQ1))))+(SUMPRODUCT((LISTEE1=W24)*((S1EQ2)+(S2EQ2)+(S3EQ3))))","v":0},0,0,0,{"$f":"IF(X24=0,\"\",RANK(AE24,$AE$23:$AE$26))","v":""},2,{"$f":"IF(X24=0,\"\",IF($AF$23=AG24,$W$23,IF($AF$24=AG24,$W$24,IF($AF$25=AG24,$W$25,IF($AF$26=AG24,$W$26)))))","v":""}]
[null,null,"B",1,18,"13:00:00",2,{"$f":"'Poule QUALIF 16 P+B'!C23","v":"T / 10"},{"$f":"'Poule QUALIF 16 P+B'!C24","v":"T / 15"},0,0,{"$f":"'Poule QUALIF 16 P+B'!M24","v":0},{"$f":"'Poule QUALIF 16 P+B'!O24","v":0},{"$f":"'Poule QUALIF 16 P+B'!Q24","v":0},{"$f":"'Poule QUALIF 16 P+B'!S24","v":0},{"$f":"'Poule QUALIF 16 P+B'!U24","v":0},{"$f":"'Poule QUALIF 16 P+B'!W24","v":0},"","",null,null,null,{"$f":"'Poule QUALIF 16 P+B'!C37","v":"T /12"},{"$f":"COUNTIF(PLACE1,W25)*2+COUNTIF(PLACE2,W25)","v":0},{"$f":"SUMIF(LISTEE1,W25,(SCEQ1))+SUMIF(LISTEE2,W25,(SCEQ2))","v":0},{"$f":"SUMIF(LISTEE1,W25,SCEQ2)+SUMIF(LISTEE2,W25,SCEQ1)","v":0},{"$f":"(SUMPRODUCT((LISTEE1=W25)*((S1EQ1)+(S2EQ1)+(S3EQ1))))+(SUMPRODUCT((LISTEE2=W25)*((S1EQ2)+(S2EQ2)+(S3EQ3))))","v":0},{"$f":"(SUMPRODUCT((LISTEE2=W25)*((S1EQ1)+(S2EQ1)+(S3EQ1))))+(SUMPRODUCT((LISTEE1=W25)*((S1EQ2)+(S2EQ2)+(S3EQ3))))","v":0},0,0,0,"",3,""]
[null,null,"C",1,19,"13:30:00",1,{"$f":"'Poule QUALIF 16 P+B'!C30","v":"T / 11"},{"$f":"'Poule QUALIF 16 P+B'!C31","v":"T / 14"},0,0,{"$f":"'Poule QUALIF 16 P+B'!M31","v":0},{"$f":"'Poule QUALIF 16 P+B'!O31","v":0},{"$f":"'Poule QUALIF 16 P+B'!Q31","v":0},{"$f":"'Poule QUALIF 16 P+B'!S31","v":0},{"$f":"'Poule QUALIF 16 P+B'!U31","v":0},{"$f":"'Poule QUALIF 16 P+B'!W31","v":0},"","",null,null,null,{"$f":"'Poule QUALIF 16 P+B'!C38","v":"T / 13"},{"$f":"COUNTIF(PLACE1,W26)*2+COUNTIF(PLACE2,W26)","v":0},{"$f":"SUMIF(LISTEE1,W26,(SCEQ1))+SUMIF(LISTEE2,W26,(SCEQ2))","v":0},{"$f":"SUMIF(LISTEE1,W26,SCEQ2)+SUMIF(LISTEE2,W26,SCEQ1)","v":0},{"$f":"(SUMPRODUCT((LISTEE1=W26)*((S1EQ1)+(S2EQ1)+(S3EQ1))))+(SUMPRODUCT((LISTEE2=W26)*((S1EQ2)+(S2EQ2)+(S3EQ3))))","v":0},{"$f":"(SUMPRODUCT((LISTEE2=W26)*((S1EQ1)+(S2EQ1)+(S3EQ1))))+(SUMPRODUCT((LISTEE1=W26)*((S1EQ2)+(S2EQ2)+(S3EQ3))))","v":0},0,0,0,"",4,{"$f":"IF(X26=0,\"\",IF($AF$23=AG26,$W$23,IF($AF$24=AG26,$W$24,IF($AF$25=AG26,$W$25,IF($AF$26=AG26,$W$26)))))","v":""}]
[null,null,"D",1,20,"13:30:00",2,{"$f":"'Poule QUALIF 16 P+B'!C37","v":"T /12"},{"$f":"'Poule QUALIF 16 P+B'!C38","v":"T / 13"},0,0,{"$f":"'Poule QUALIF 16 P+B'!M38","v":0},{"$f":"'Poule QUALIF 16 P+B'!O38","v":0},{"$f":"'Poule QUALIF 16 P+B'!Q38","v":0},{"$f":"'Poule QUALIF 16 P+B'!S38","v":0},{"$f":"'Poule QUALIF 16 P+B'!U38","v":0},{"$f":"'Poule QUALIF 16 P+B'!W38","v":0},"",""]
[null,null,"A",1,21,"14:00:00",1,{"$f":"'Poule QUALIF 16 P+B'!C14","v":"T / 1"},{"$f":"'Poule QUALIF 16 P+B'!C15","v":"T / 8"},0,0,{"$f":"'Poule QUALIF 16 P+B'!M18","v":0},{"$f":"'Poule QUALIF 16 P+B'!O18","v":0},{"$f":"'Poule QUALIF 16 P+B'!Q18","v":0},{"$f":"'Poule QUALIF 16 P+B'!S18","v":0},{"$f":"'Poule QUALIF 16 P+B'!U18","v":0},{"$f":"'Poule QUALIF 16 P+B'!W18","v":0},{"$f":"IF(J28=K28,\"\",IF(J28>K28,H28,I28))","v":""},{"$f":"IF(J28=K28,\"\",IF(J28<K28,H28,I28))","v":""}]
[null,null,"B",1,22,"14:00:00",2,{"$f":"'Poule QUALIF 16 P+B'!C21","v":"T / 2"},{"$f":"'Poule QUALIF 16 P+B'!C22","v":"T / 7"},0,0,{"$f":"'Poule QUALIF 16 P+B'!M25","v":0},{"$f":"'Poule QUALIF 16 P+B'!O25","v":0},{"$f":"'Poule QUALIF 16 P+B'!Q25","v":0},{"$f":"'Poule QUALIF 16 P+B'!S25","v":0},{"$f":"'Poule QUALIF 16 P+B'!U25","v":0},{"$f":"'Poule QUALIF 16 P+B'!W25","v":0},"",""]
[null,null,"C",1,23,"14:30:00",1,{"$f":"'Poule QUALIF 16 P+B'!C28","v":"T / 3"},{"$f":"'Poule QUALIF 16 P+B'!C29","v":"T / 6"},0,0,{"$f":"'Poule QUALIF 16 P+B'!M32","v":0},{"$f":"'Poule QUALIF 16 P+B'!O32","v":0},{"$f":"'Poule QUALIF 16 P+B'!Q32","v":0},{"$f":"'Poule QUALIF 16 P+B'!S32","v":0},{"$f":"'Poule QUALIF 16 P+B'!U32","v":0},{"$f":"'Poule QUALIF 16 P+B'!W32","v":0},"",""]
[null,null,"D",1,24,"14:30:00",2,{"$f":"'Poule QUALIF 16 P+B'!C35","v":"T / 4"},{"$f":"'Poule QUALIF 16 P+B'!C36","v":"T / 5"},0,0,{"$f":"'Poule QUALIF 16 P+B'!M39","v":0},{"$f":"'Poule QUALIF 16 P+B'!O39","v":0},{"$f":"'Poule QUALIF 16 P+B'!Q39","v":0},{"$f":"'Poule QUALIF 16 P+B'!S39","v":0},{"$f":"'Poule QUALIF 16 P+B'!U39","v":0},{"$f":"'Poule QUALIF 16 P+B'!W39","v":0},{"$f":"IF(J31=K31,\"\",IF(J31>K31,H31,I31))","v":""},""]
[null,null,"BARR",1,25,"15:00:00",1,{"$f":"'Poule QUALIF 16 P+B'!AD13","v":0},{"$f":"'Poule QUALIF 16 P+B'!AD16","v":0},{"$f":"SUM(IF(L32>M32,1,0),IF(N32>O32,1,0),IF(P32>Q32,1,0))","v":0},{"$f":"SUM(IF(M32>L32,1,0),IF(O32>N32,1,0),IF(Q32>P32,1,0))","v":0},{"$f":"'Poule QUALIF 16 P+B'!AG14","v":0},{"$f":"'Poule QUALIF 16 P+B'!AI14","v":0},{"$f":"'Poule QUALIF 16 P+B'!AK14","v":0},{"$f":"'Poule QUALIF 16 P+B'!AM14","v":0},{"$f":"'Poule QUALIF 16 P+B'!AO14","v":0},{"$f":"'Poule QUALIF 16 P+B'!AQ14","v":0},{"$f":"IF(J32=K32,\"\",IF(J32>K32,H32,I32))","v":""},""]
[null,null,"BARR",1,26,"15:00:00",2,{"$f":"'Poule QUALIF 16 P+B'!AD19","v":0},{"$f":"'Poule QUALIF 16 P+B'!AD22","v":0},0,0,{"$f":"'Poule QUALIF 16 P+B'!AG20","v":0},{"$f":"'Poule QUALIF 16 P+B'!AI20","v":0},{"$f":"'Poule QUALIF 16 P+B'!AK20","v":0},{"$f":"'Poule QUALIF 16 P+B'!AM20","v":0},{"$f":"'Poule QUALIF 16 P+B'!AO20","v":0},{"$f":"'Poule QUALIF 16 P+B'!AQ20","v":0},{"$f":"IF(J33=K33,\"\",IF(J33>K33,H33,I33))","v":""},""]
[null,null,"BARR",1,27,"15:30:00",1,{"$f":"AH9","v":""},null,0,0,null,null,null,null,null,null,"",""]
[null,null,"BARR",1,28,"15:30:00",2,{"$f":"AH24","v":""},null,0,0,null,null,null,null,null,null,"",""]
[null,null,"1/4",1,29,"16:00:00",1,{"$f":"AH8","v":""},{"$f":"R32","v":""},0,0,null,null,null,null,null,null,"",""]
[null,null,"1/4",1,30,"16:00:00",2,{"$f":"AH23","v":""},{"$f":"R33","v":""},0,0,null,null,null,null,null,null,"",""]
[null,null,"1/4",1,31,"16:30:00",1,{"$f":"AH18","v":""},{"$f":"R34","v":""},0,0,null,null,null,null,null,null,"",""]
[null,null,"1/4",1,32,"16:30:00",2,{"$f":"AH13","v":""},{"$f":"R35","v":""},0,0,null,null,null,null,null,null,"",""]
[null,null,"1/2",1,33,"17:00:00",null,{"$f":"R36","v":""},{"$f":"R37","v":""},0,0,null,null,null,null,null,null,"",""]
[null,null,"1/2",1,34,{"$f":"F40+$B$4","v":"17:30:00"},null,{"$f":"R39","v":""},{"$f":"R38","v":""},0,0,null,null,null,null,null,null,"",""]
[null,null,"3-4",1,35,{"$f":"F41+$B$4","v":"18:00:00"},null,{"$f":"S40","v":""},{"$f":"S41","v":""},0,0,null,null,null,null,null,null,"",""]
[null,null,"F",1,36,{"$f":"F42+$B$4","v":"18:30:00"},null,{"$f":"R40","v":""},{"$f":"R41","v":""},0,0,null,null,null,null,null,null,"",""]

{"sheet":"Poule QUALIF 16 P+B","index":4,"n_rows":39,"n_cols":51,"rows_kept":39,"cut":false,"hidden":false,"merged":[[27,50,27,56],[24,50,24,56],[25,50,25,56],[26,50,26,56],[21,32,21,34],[21,36,21,38],[21,40,21,42],[21,50,21,56],[22,50,22,56],[23,50,23,56],[20,32,20,34],[20,36,20,38],[20,40,20,42],[20,50,20,56],[15,32,15,34],[15,36,15,38],[15,40,15,42],[15,50,15,56],[16,50,16,56],[17,50,17,56],[18,32,18,34],[18,36,18,38],[18,40,18,42],[18,50,18,56],[19,50,19,56],[14,32,14,34],[14,36,14,38],[14,40,14,42],[14,50,14,56],[6,6,6,29],[10,12,10,16],[10,29,10,30],[10,49,10,54],[12,32,12,34],[12,36,12,38],[12,40,12,42],[12,50,12,56],[13,50,13,56],[11,3,11,5],[11,12,11,14],[11,16,11,18],[11,20,11,22],[0,6,3,25],[0,26,4,29],[4,6,4,16],[4,17,4,22],[4,23,4,25],[5,6,5,29]]}
[null,null,null,null,null,null,{"$f":"IF('LISTE ENGAGES'!Q3=\"\",'LISTE ENGAGES'!P3,'LISTE ENGAGES'!Q3)","v":"APPELATION TOURNOI"},null,null,null,null,null,null,null,null,null,null,null,null,null,null,null,null,null,null,null,{"$f":"'LISTE ENGAGES'!H1:H3","v":"ORGANISATEUR"}]
[]
[]
[]
[null,null,null,null,null,null,{"$f":"IF('LISTE ENGAGES'!Q4=\"\",'LISTE ENGAGES'!P4,'LISTE ENGAGES'!Q4)","v":"LIEU"},null,null,null,null,null,null,null,null,null,null,{"$f":"'LISTE ENGAGES'!F4","v":"DATE"},null,null,null,null,null,{"$f":"'LISTE ENGAGES'!H4","v":"GENRE"}]
[null,null,null,null,null,null,{"$f":"IF('LISTE ENGAGES'!Q5<>\"\",'LISTE ENGAGES'!Q5,'LISTE ENGAGES'!P5)","v":"TYPE"}]
[null,null,null,null,null,null,"TABLEAU DE QUALIFICATION"]
[]
[]
[]
[null,null,"POULES",null,null,null,null,null,null,null,null,null,"RESULTATS",null,null,null,null,null,null,null,null,null,null,null,null,null,"CLASS. POUL",null,null,"BARRAGES",null,null,null,null,null,null,null,null,null,null,null,null,null,null,null,null,null,null,null,"CLASSEMENT FINAL"]
[null,null,null,"ORDRE",null,null,"H ","T","A",null,"SCORE",null,"Set 1",null,null,null,"Set 2",null,null,null,"Set 3",null,null,null,null,"POULE"]
[null,null,null,"1-4",{"$f":"CONCATENATE(C14,\" - \",C17)","v":"T / 1 - T / 16"},"(1)",{"$f":"'PLANNING PS 16'!D17","v":"09:00:00"},null,null,null,{"$f":"CONCATENATE(\"(\",'SCORE QUALIF'!J8,\"/\",'SCORE QUALIF'!K8,\")\")","v":"(0/0)"},":",null,"/",null,";",null,"/",null,";",null,"/",null,null,null,null,null,null,null,null,"SCORE",null,"Set 1",null,null,null,"Set 2",null,null,null,"Set 3",null,null,null,null,null,null,null,null,"Qualifié -",{"$f":"AA14","v":""}]
[null,"T1",{"$f":"CONCATENATE('EMARG M Tableau QUALIF'!C9,\" / \",'EMARG M Tableau QUALIF'!G9)","v":"T / 1"},"2-3",{"$f":"CONCATENATE(C15,\" - \",C16)","v":"T / 8 - T / 9"},"(5)",null,null,null,null,{"$f":"CONCATENATE(\"(\",'SCORE QUALIF'!J12,\"/\",'SCORE QUALIF'!K12,\")\")","v":"(0/0)"},":",null,"/",null,";",null,"/",null,";",null,"/",null,null,null,1,{"$f":"'SCORE QUALIF'!AH8","v":""},null,null,null,{"$f":"CONCATENATE(\"(\",'SCORE QUALIF'!J32,\"/\",'SCORE QUALIF'!K32,\")\")","v":"(0/0)"},null,null,"/",null,null,null,"/",null,null,null,"/",null,null,null,null,null,null,null,"Qualifié -",{"$f":"AA21","v":""}]
["A","T8",{"$f":"CONCATENATE('EMARG M Tableau QUALIF'!C16,\" / \",'EMARG M Tableau QUALIF'!G16)","v":"T / 8"},"2-4",{"$f":"CONCATENATE(C15,\" - \",C17)","v":"T / 8 - T / 16"},"(9)",null,null,null,null,{"$f":"CONCATENATE(\"(\",'SCORE QUALIF'!J16,\"/\",'SCORE QUALIF'!K16,\")\")","v":"(0/0)"},":",null,"/",null,";",null,"/",null,";",null,"/",null,null,null,2,{"$f":"'SCORE QUALIF'!AH9","v":""},null,"(B1)",null,null,null,"HEURE",null,null,null,"TERR",null,null,null,"ARB.",null,null,null,null,null,null,null,null,"Qualifié -",{"$f":"AA28","v":""}]
[null,"T9",{"$f":"CONCATENATE('EMARG M Tableau QUALIF'!C17,\" / \",'EMARG M Tableau QUALIF'!G17)","v":"T / 9"},"1-3",{"$f":"CONCATENATE(C14,\" - \",C16)","v":"T / 1 - T / 9"},"(13)",null,null,null,null,{"$f":"CONCATENATE(\"(\",'SCORE QUALIF'!J20,\"/\",'SCORE QUALIF'!K20,\")\")","v":"(0/0)"},":",null,"/",null,";",null,"/",null,";",null,"/",null,null,null,3,{"$f":"'SCORE QUALIF'!AH10","v":""},null,null,null,null,null,null,null,null,null,null,null,null,null,null,null,null,null,null,null,null,null,null,"Qualifié -",{"$f":"AA35","v":""}]
[null,"T16",{"$f":"CONCATENATE('EMARG M Tableau QUALIF'!C24,\" / \",'EMARG M Tableau QUALIF'!G24)","v":"T / 16"},"3-4",{"$f":"CONCATENATE(C16,\" - \",C17)","v":"T / 9 - T / 16"},"(17)",null,null,null,null,{"$f":"CONCATENATE(\"(\",'SCORE QUALIF'!J24,\"/\",'SCORE QUALIF'!K24,\")\")","v":"(0/0)"},":",null,"/",null,";",null,"/",null,";",null,"/",null,null,null,4,{"$f":"'SCORE QUALIF'!AH11","v":""},null,null,null,null,null,null,null,null,null,null,null,null,null,null,null,null,null,null,null,null,null,null,"Qualifié -",{"$f":"'SCORE QUALIF'!R32","v":""}]
[null,null,null,"1-2",{"$f":"CONCATENATE(C14,\" - \",C15)","v":"T / 1 - T / 8"},"(21)",null,null,null,null,{"$f":"CONCATENATE(\"(\",'SCORE QUALIF'!J28,\"/\",'SCORE QUALIF'!K28,\")\")","v":"(0/0)"},":",null,"/",null,";",null,"/",null,";",null,"/",null,null,null,null,null,null,null,null,null,null,null,null,null,null,null,null,null,null,null,null,null,null,null,null,null,null,null,"Qualifié -",{"$f":"'SCORE QUALIF'!R33","v":""}]
[null,null,null,null,null,null,null,null,null,null,null,null,null,null,null,null,null,null,null,null,null,null,null,null,null,null,null,null,null,null,"SCORE",null,"Set 1",null,null,null,"Set 2",null,null,null,"Set 3",null,null,null,null,null,null,null,null,"7 -",{"$f":"'SCORE QUALIF'!S32","v":""}]
[null,null,null,"1-4",{"$f":"CONCATENATE(C21,\" - \",C24)","v":"T / 2 - T / 15"},"(3)",null,null,null,null,{"$f":"CONCATENATE(\"(\",'SCORE QUALIF'!J9,\"/\",'SCORE QUALIF'!K9,\")\")","v":"(0/0)"},":",null,"/",null,";",null,"/",null,";",null,"/",null,null,null,null,null,null,null,null,{"$f":"CONCATENATE(\"(\",'SCORE QUALIF'!J33,\"/\",'SCORE QUALIF'!K33,\")\")","v":"(0/0)"},null,null,"/",null,null,null,"/",null,null,null,"/",null,null,null,null,null,null,null,"8 -",{"$f":"'SCORE QUALIF'!S33","v":""}]
[null,"T2",{"$f":"CONCATENATE('EMARG M Tableau QUALIF'!C10,\" / \",'EMARG M Tableau QUALIF'!G10)","v":"T / 2"},"2-3",{"$f":"CONCATENATE(C22,\" - \",C23)","v":"T / 7 - T / 10"},"(7)",null,null,null,null,{"$f":"CONCATENATE(\"(\",'SCORE QUALIF'!J13,\"/\",'SCORE QUALIF'!K13,\")\")","v":"(0/0)"},":",null,"/",null,";",null,"/",null,";",null,"/",null,null,null,1,{"$f":"'SCORE QUALIF'!AH13","v":""},null,"(B2)",null,null,null,"HEURE",null,null,null,"TERR",null,null,null,"ARB.",null,null,null,null,null,null,null,null,"9 -",{"$f":"AA16","v":""}]
["B","T7",{"$f":"CONCATENATE('EMARG M Tableau QUALIF'!C15,\" / \",'EMARG M Tableau QUALIF'!G15)","v":"T / 7"},"2-4",{"$f":"CONCATENATE(C22,\" - \",C24)","v":"T / 7 - T / 15"},"(11)",null,null,null,null,{"$f":"CONCATENATE(\"(\",'SCORE QUALIF'!J17,\"/\",'SCORE QUALIF'!K17,\")\")","v":"(0/0)"},":",null,"/",null,";",null,"/",null,";",null,"/",null,null,null,2,{"$f":"'SCORE QUALIF'!AH14","v":""},null,null,null,null,null,null,null,null,null,null,null,null,null,null,null,null,null,null,null,null,null,null,"10 -",{"$f":"AA23","v":""}]
[null,"T10",{"$f":"CONCATENATE('EMARG M Tableau QUALIF'!C18,\" / \",'EMARG M Tableau QUALIF'!G18)","v":"T / 10"},"1-3",{"$f":"CONCATENATE(C21,\" - \",C23)","v":"T / 2 - T / 10"},"(15)",null,null,null,null,{"$f":"CONCATENATE(\"(\",'SCORE QUALIF'!J21,\"/\",'SCORE QUALIF'!K21,\")\")","v":"(0/0)"},":",null,"/",null,";",null,"/",null,";",null,"/",null,null,null,3,{"$f":"'SCORE QUALIF'!AH15","v":""},null,null,null,null,null,null,null,null,null,null,null,null,null,null,null,null,null,null,null,null,null,null,"11 -",{"$f":"AA30","v":""}]
[null,"T15",{"$f":"CONCATENATE('EMARG M Tableau QUALIF'!C23,\" / \",'EMARG M Tableau QUALIF'!G23)","v":"T / 15"},"3-4",{"$f":"CONCATENATE(C23,\" - \",C24)","v":"T / 10 - T / 15"},"(19)",null,null,null,null,{"$f":"CONCATENATE(\"(\",'SCORE QUALIF'!J25,\"/\",'SCORE QUALIF'!K25,\")\")","v":"(0/0)"},":",null,"/",null,";",null,"/",null,";",null,"/",null,null,null,4,{"$f":"'SCORE QUALIF'!AH16","v":""},null,null,null,null,null,null,null,null,null,null,null,null,null,null,null,null,null,null,null,null,null,null,"12 -",{"$f":"AA37","v":""}]
[null,null,null,"1-2",{"$f":"CONCATENATE(C21,\" - \",C24)","v":"T / 2 - T / 15"},"(23)",null,null,null,null,{"$f":"CONCATENATE(\"(\",'SCORE QUALIF'!J29,\"/\",'SCORE QUALIF'!K29,\")\")","v":"(0/0)"},":",null,"/",null,";",null,"/",null,";",null,"/",null,null,null,null,null,null,null,null,null,null,null,null,null,null,null,null,null,null,null,null,null,null,null,null,null,null,null,"13 -",{"$f":"AA17","v":""}]
[null,null,null,null,null,null,null,null,null,null,null,null,null,null,null,null,null,null,null,null,null,null,null,null,null,null,null,null,null,null,null,null,null,null,null,null,null,null,null,null,null,null,null,null,null,null,null,null,null,"14 -",{"$f":"AA24","v":""}]
[null,null,null,"1-4",{"$f":"CONCATENATE(C28,\" - \",C31)","v":"T / 3 - T / 14"},"(2)",{"$f":"'PLANNING PS 16'!D17","v":"09:00:00"},null,null,null,{"$f":"CONCATENATE(\"(\",'SCORE QUALIF'!J10,\"/\",'SCORE QUALIF'!K10,\")\")","v":"(0/0)"},":",null,"/",null,";",null,"/",null,";",null,"/",null,null,null,null,null,null,null,null,null,null,null,null,null,null,null,null,null,null,null,null,null,null,null,null,null,null,null,"15 -",{"$f":"AA31","v":""}]
[null,"T3",{"$f":"CONCATENATE('EMARG M Tableau QUALIF'!C11,\" / \",'EMARG M Tableau QUALIF'!G11)","v":"T / 3"},"2-3",{"$f":"CONCATENATE(C29,\" - \",C30)","v":"T / 6 - T / 11"},"(6)",null,null,null,null,{"$f":"CONCATENATE(\"(\",'SCORE QUALIF'!J14,\"/\",'SCORE QUALIF'!K14,\")\")","v":"(0/0)"},":",null,"/",null,";",null,"/",null,";",null,"/",null,null,null,1,{"$f":"'SCORE QUALIF'!AH18","v":""},null,null,null,null,null,null,null,null,null,null,null,null,null,null,null,null,null,null,null,null,null,null,"16 -",{"$f":"AA38","v":""}]
["C","T6",{"$f":"CONCATENATE('EMARG M Tableau QUALIF'!C14,\" / \",'EMARG M Tableau QUALIF'!G14)","v":"T / 6"},"2-4",{"$f":"CONCATENATE(C29,\" - \",C31)","v":"T / 6 - T / 14"},"(10)",null,null,null,null,{"$f":"CONCATENATE(\"(\",'SCORE QUALIF'!J18,\"/\",'SCORE QUALIF'!K18,\")\")","v":"(0/0)"},":",null,"/",null,";",null,"/",null,";",null,"/",null,null,null,2,{"$f":"'SCORE QUALIF'!AH19","v":""}]
[null,"T11",{"$f":"CONCATENATE('EMARG M Tableau QUALIF'!C19,\" / \",'EMARG M Tableau QUALIF'!G19)","v":"T / 11"},"1-3",{"$f":"CONCATENATE(C28,\" - \",C30)","v":"T / 3 - T / 11"},"(14)",null,null,null,null,{"$f":"CONCATENATE(\"(\",'SCORE QUALIF'!J22,\"/\",'SCORE QUALIF'!K22,\")\")","v":"(0/0)"},":",null,"/",null,";",null,"/",null,";",null,"/",null,null,null,3,{"$f":"'SCORE QUALIF'!AH20","v":""}]
[null,"T14",{"$f":"CONCATENATE('EMARG M Tableau QUALIF'!C22,\" / \",'EMARG M Tableau QUALIF'!G22)","v":"T / 14"},"3-4",{"$f":"CONCATENATE(C30,\" - \",C31)","v":"T / 11 - T / 14"},"(18)",null,null,null,null,{"$f":"CONCATENATE(\"(\",'SCORE QUALIF'!J26,\"/\",'SCORE QUALIF'!K26,\")\")","v":"(0/0)"},":",null,"/",null,";",null,"/",null,";",null,"/",null,null,null,4,{"$f":"'SCORE QUALIF'!AH21","v":""}]
[null,null,null,"1-2",{"$f":"CONCATENATE(C28,\" - \",C29)","v":"T / 3 - T / 6"},"(22)",null,null,null,null,{"$f":"CONCATENATE(\"(\",'SCORE QUALIF'!J30,\"/\",'SCORE QUALIF'!K30,\")\")","v":"(0/0)"},":",null,"/",null,";",null,"/",null,";",null,"/"]
[]
[null,null,null,"1-4",{"$f":"CONCATENATE(C35,\" - \",C38)","v":"T / 4 - T / 13"},"(4)",null,null,null,null,{"$f":"CONCATENATE(\"(\",'SCORE QUALIF'!J11,\"/\",'SCORE QUALIF'!K11,\")\")","v":"(0/0)"},":",null,"/",null,";",null,"/",null,";",null,"/"]
[null,"T4",{"$f":"CONCATENATE('EMARG M Tableau QUALIF'!C12,\" / \",'EMARG M Tableau QUALIF'!G12)","v":"T / 4"},"2-3",{"$f":"CONCATENATE(C36,\" - \",C37)","v":"T / 5 - T /12"},"(8)",null,null,null,null,{"$f":"CONCATENATE(\"(\",'SCORE QUALIF'!J15,\"/\",'SCORE QUALIF'!K15,\")\")","v":"(0/0)"},":",null,"/",null,";",null,"/",null,";",null,"/",null,null,null,1,{"$f":"'SCORE QUALIF'!AH23","v":""}]
["D","T5",{"$f":"CONCATENATE('EMARG M Tableau QUALIF'!C13,\" / \",'EMARG M Tableau QUALIF'!G13)","v":"T / 5"},"2-4",{"$f":"CONCATENATE(C36,\" - \",C38)","v":"T / 5 - T / 13"},"(12)",null,null,null,null,{"$f":"CONCATENATE(\"(\",'SCORE QUALIF'!J19,\"/\",'SCORE QUALIF'!K19,\")\")","v":"(0/0)"},":",null,"/",null,";",null,"/",null,";",null,"/",null,null,null,2,{"$f":"'SCORE QUALIF'!AH24","v":""}]
[null,"T12",{"$f":"CONCATENATE('EMARG M Tableau QUALIF'!C20,\" /\",'EMARG M Tableau QUALIF'!G20)","v":"T /12"},"1-3",{"$f":"CONCATENATE(C35,\" - \",C37)","v":"T / 4 - T /12"},"(16)",null,null,null,null,{"$f":"CONCATENATE(\"(\",'SCORE QUALIF'!J23,\"/\",'SCORE QUALIF'!K23,\")\")","v":"(0/0)"},":",null,"/",null,";",null,"/",null,";",null,"/",null,null,null,3,{"$f":"'SCORE QUALIF'!AH25","v":""}]
[null,"T13",{"$f":"CONCATENATE('EMARG M Tableau QUALIF'!C21,\" / \",'EMARG M Tableau QUALIF'!G21)","v":"T / 13"},"3-4",{"$f":"CONCATENATE(C37,\" - \",C38)","v":"T /12 - T / 13"},"(20)",null,null,null,null,{"$f":"CONCATENATE(\"(\",'SCORE QUALIF'!J27,\"/\",'SCORE QUALIF'!K27,\")\")","v":"(0/0)"},":",null,"/",null,";",null,"/",null,";",null,"/",null,null,null,4,{"$f":"'SCORE QUALIF'!AH26","v":""}]
[null,null,null,"1-2",{"$f":"CONCATENATE(C35,\" - \",C36)","v":"T / 4 - T / 5"},"(24)",null,null,null,null,{"$f":"CONCATENATE(\"(\",'SCORE QUALIF'!J31,\"/\",'SCORE QUALIF'!K31,\")\")","v":"(0/0)"},":",null,"/",null,";",null,"/",null,";",null,"/"]

{"sheet":"EMARG M Tableau PRIN","index":5,"n_rows":29,"n_cols":15,"rows_kept":29,"cut":false,"hidden":false,"merged":[[5,3,5,13],[1,3,2,12],[1,13,3,13],[3,3,3,6],[3,7,3,11],[4,3,4,13]]}
[]
[null,null,null,{"$f":"IF('LISTE ENGAGES'!Q3=\"\",'LISTE ENGAGES'!P3,'LISTE ENGAGES'!Q3)","v":"APPELATION TOURNOI"},null,null,null,null,null,null,null,null,null,{"$f":"'LISTE ENGAGES'!H1:H3","v":0}]
[]
[null,null,null,{"$f":"IF('LISTE ENGAGES'!Q4=\"\",'LISTE ENGAGES'!P4,'LISTE ENGAGES'!Q4)","v":"LIEU"},null,null,null,{"$f":"'LISTE ENGAGES'!F4","v":"DATE"},null,null,null,null,{"$f":"'LISTE ENGAGES'!H4","v":"GENRE"}]
[null,null,null,{"$f":"IF('LISTE ENGAGES'!Q5<>\"\",'LISTE ENGAGES'!Q5,'LISTE ENGAGES'!P5)","v":"TYPE"}]
[null,null,null,"FEUILLE EMARGEMENT"]
[]
["N°",null,"NOM","PRENOM","LICENCE","CLUB","NOM","PRENOM","LICENCE","CLUB","pts","tir","SIGNATURE JOUEUR1","SIGNATURE JOUEUR2","Rglt"]
[1,null,"T",null,null,null,1]
[2,null,"T",null,null,null,2]
[3,null,"T",null,null,null,3]
[4,null,"T",null,null,null,4]
[5,null,"T",null,null,null,5]
[6,null,"T",null,null,null,6]
[7,null,"T",null,null,null,7]
[8,null,"T",null,null,null,8]
[9,null,"T",null,null,null,9]
[10,null,"T",null,null,null,10]
[11,null,"T",null,null,null,11]
[12,null,"T",null,null,null,12]
[13,null,"T",null,null,null,13]
[14,null,"T",null,null,null,14]
[15,null,"T",null,null,null,15]
[16,null,"T",null,null,null,16]
[]
[null,null,"Copier/coller selon LISTE ENGAGES en fonction des équipes confirmées APRES les qualifications"]
[null,null,"ATTENTION : Respecter l'ordre des têtes de séries en fonction des points et classement de la LISTE ENGAGES"]
[null,null,"Ex: Si Sur LISTE ENGAGES, l'équipe 9 absente, la numéro 10 devient la numéro 9 dans EMARG"]
[null,null,"EX: Si toutes les equipes du tableau principal sont confirmées, les équipes issues qualifications sont replacées en fonction de leurs points, en bas de tableau"]

{"sheet":"PLANNING PS 16","index":6,"n_rows":42,"n_cols":19,"rows_kept":42,"cut":false,"hidden":false,"merged":[[8,2,8,3],[1,7,4,15],[1,16,7,17],[3,2,3,3],[5,7,5,9],[5,10,5,13],[5,14,5,15],[6,7,6,15],[7,7,7,15]]}
[]
[null,null,null,null,null,null,null,{"$f":"IF('LISTE ENGAGES'!Q3<>\"\",'LISTE ENGAGES'!Q3,'LISTE ENGAGES'!P3)","v":"APPELATION TOURNOI"},null,null,null,null,null,null,null,null,{"$f":"'LISTE ENGAGES'!H1:H3","v":0}]
[]
[null,"J1","HEURE DEBUT",null,"09:00:00"]
[null,null,"DUREE MATCH",null,"00:35:00"]
[null,null,null,null,null,null,null,{"$f":"IF('LISTE ENGAGES'!Q4=\"\",'LISTE ENGAGES'!P4,'LISTE ENGAGES'!Q4)","v":"LIEU"},null,null,{"$f":"'LISTE ENGAGES'!F4","v":"DATE"},null,null,null,{"$f":"'LISTE ENGAGES'!H4","v":"GENRE"}]
[null,null,null,null,null,null,null,{"$f":"IF('LISTE ENGAGES'!Q5<>\"\",'LISTE ENGAGES'!Q5,'LISTE ENGAGES'!P5)","v":"TYPE"}]
[null,null,null,null,null,null,null,"PLANNING DES RENCONTRES"]
[null,"J2","HEURE DEBUT",null,"09:00:00"]
[null,null,"DUREE MATCH",null,"01:00:00"]
[]
[]
[]
[]
[]
[null,null,null,null,"MATCH","n°","TER.","E1","./.","E2","ARB","MATCH","n°","TER.","E1","./.","E2","ARB","2*15, SD 11"]
[null,null,"JOUR 1",{"$f":"E4","v":"09:00:00"},"AM1",1,null,{"$f":"'Poule 16 PS'!C14","v":"T / 1"},null,{"$f":"'Poule 16 PS'!C17","v":"T / 16"},null,"CM1",2,null,{"$f":"'Poule 16 PS'!C28","v":"T / 3"},null,{"$f":"'Poule 16 PS'!C31","v":"T / 14"},null,"2*15, SD 11"]
[null,null,null,{"$f":"D17+$E$5","v":"09:35:00"},"BM1",3,null,{"$f":"'Poule 16 PS'!C21","v":"T / 2"},null,{"$f":"'Poule 16 PS'!C24","v":"T / 15"},null,"DM1",4,null,{"$f":"'Poule 16 PS'!C35","v":"T / 4"},null,{"$f":"'Poule 16 PS'!C38","v":"T / 13"},null,"2*15, SD 11"]
[null,null,null,{"$f":"D18+$E$5","v":"10:10:00"},"AM2",5,null,{"$f":"'Poule 16 PS'!C15","v":"T / 8"},null,{"$f":"'Poule 16 PS'!C16","v":"T / 9"},null,"CM2",6,null,{"$f":"'Poule 16 PS'!C29","v":"T / 6"},null,{"$f":"'Poule 16 PS'!C30","v":"T / 11"},null,"2*15, SD 11"]
[null,null,null,"10:45:00","BM2",7,null,{"$f":"'Poule 16 PS'!C22","v":"T / 7"},null,{"$f":"'Poule 16 PS'!C23","v":"T / 10"},null,"DM2",8,null,{"$f":"'Poule 16 PS'!C36","v":"T / 5"},null,{"$f":"'Poule 16 PS'!C37","v":"T /12"},null,"2*15, SD 11"]
[null,null,null,"11:20:00","AM3",9,null,{"$f":"'Poule 16 PS'!C15","v":"T / 8"},null,{"$f":"'Poule 16 PS'!C17","v":"T / 16"},null,"CM3",10,null,{"$f":"'Poule 16 PS'!C29","v":"T / 6"},null,{"$f":"'Poule 16 PS'!C31","v":"T / 14"},null,"2*15, SD 11"]
[null,null,null,"11:55:00","BM3",11,null,{"$f":"'Poule 16 PS'!C22","v":"T / 7"},null,{"$f":"'Poule 16 PS'!C24","v":"T / 15"},null,"DM3",12,null,{"$f":"'Poule 16 PS'!C36","v":"T / 5"},null,{"$f":"'Poule 16 PS'!C38","v":"T / 13"},null,"2*15, SD 11"]
[null,null,null,"12:30:00","AM4",13,null,{"$f":"'Poule 16 PS'!C14","v":"T / 1"},null,{"$f":"'Poule 16 PS'!C16","v":"T / 9"},null,"CM4",14,null,{"$f":"'Poule 16 PS'!C28","v":"T / 3"},null,{"$f":"'Poule 16 PS'!C30","v":"T / 11"},null,"2*15, SD 11"]
[null,null,null,"13:05:00","BM4",15,null,{"$f":"'Poule 16 PS'!C21","v":"T / 2"},null,{"$f":"'Poule 16 PS'!C23","v":"T / 10"},null,"DM4",16,null,{"$f":"'Poule 16 PS'!C35","v":"T / 4"},null,{"$f":"'Poule 16 PS'!C37","v":"T /12"},null,"2*15, SD 11"]
[null,null,null,"13:40:00","AM5",17,null,{"$f":"'Poule 16 PS'!C16","v":"T / 9"},null,{"$f":"'Poule 16 PS'!C17","v":"T / 16"},null,"CM5",18,null,{"$f":"'Poule 16 PS'!C30","v":"T / 11"},null,{"$f":"'Poule 16 PS'!C31","v":"T / 14"},null,"2*15, SD 11"]
[null,null,null,"14:15:00","BM5",19,null,{"$f":"'Poule 16 PS'!C23","v":"T / 10"},null,{"$f":"'Poule 16 PS'!C24","v":"T / 15"},null,"DM5",20,null,{"$f":"'Poule 16 PS'!C37","v":"T /12"},null,{"$f":"'Poule 16 PS'!C38","v":"T / 13"},null,"2*15, SD 11"]
[null,null,null,"14:50:00","AM6",21,null,{"$f":"'Poule 16 PS'!C14","v":"T / 1"},null,{"$f":"'Poule 16 PS'!C15","v":"T / 8"},null,"CM6",22,null,{"$f":"'Poule 16 PS'!C28","v":"T / 3"},null,{"$f":"'Poule 16 PS'!C29","v":"T / 6"},null,"2*15, SD 11"]
[null,null,null,"15:25:00","BM6",23,null,{"$f":"'Poule 16 PS'!C21","v":"T / 2"},null,{"$f":"'Poule 16 PS'!C22","v":"T / 7"},null,"DM6",24,null,{"$f":"'Poule 16 PS'!C35","v":"T / 4"},null,{"$f":"'Poule 16 PS'!C36","v":"T / 5"},null,"2*15, SD 11"]
[null,null,null,"16:00:00","PAUSE"]
[null,null,null,"16:35:00","BARRAGE","B1",null,{"$f":"'Poule 16 PS'!AD13","v":""},null,{"$f":"'Poule 16 PS'!AD16","v":""},null,"BARR.","B2",null,{"$f":"'Poule 16 PS'!AD19","v":""},null,{"$f":"'Poule 16 PS'!AD22","v":""}]
[null,null,null,"17:10:00","BARRAGE","B3",null,{"$f":"'Poule 16 PS'!AD25","v":""},null,{"$f":"'Poule 16 PS'!AD28","v":""},null,"BARR.","B4",null,{"$f":"'Poule 16 PS'!AD31","v":""},null,{"$f":"'Poule 16 PS'!AD34","v":""}]
[null,null,null,"17:45:00","FIN"]
[]
[null,null,null,null,"MATCH",null,"TER.","E1","./.","E2","ARB","MATCH",null,"TER.","E1","./.","E2","ARB","2*21, SD 15"]
[null,null,"JOUR 2",{"$f":"E9","v":"09:00:00"},"1/4 M1",25,null,{"$f":"'SCORE 16 PRINC'!H36","v":""},null,{"$f":"'SCORE 16 PRINC'!I36","v":""},null,"1/4 M2",26,null,{"$f":"'SCORE 16 PRINC'!H37","v":""},null,{"$f":"'SCORE 16 PRINC'!I37","v":""},null,"2*21, SD 15"]
[null,null,null,{"$f":"D35+$E$10","v":"10:00:00"},"1/4 M3",27,null,{"$f":"'SCORE 16 PRINC'!H38","v":""},null,{"$f":"'SCORE 16 PRINC'!I38","v":""},null,"1/4 M4",28,null,{"$f":"'SCORE 16 PRINC'!H39","v":""},null,{"$f":"'SCORE 16 PRINC'!I39","v":""},null,"2*21, SD 15"]
[null,null,null,{"$f":"D36+$E$10","v":"11:00:00"},"DEMI",29,null,{"$f":"'SCORE 16 PRINC'!H40","v":""},null,{"$f":"'SCORE 16 PRINC'!I40","v":""},null,null,null,null,null,null,null,null,"2*21, SD 15"]
[null,null,null,"12:00:00","DEMI",30,null,{"$f":"'SCORE 16 PRINC'!H41","v":""},null,{"$f":"'SCORE 16 PRINC'!I41","v":""},null,null,null,null,null,null,null,null,"2*21, SD 15"]
[null,null,null,"13:00:00"]
[null,null,null,"14:00:00","PETITE FINALE",31,null,{"$f":"'SCORE 16 PRINC'!H42","v":""},null,{"$f":"'SCORE 16 PRINC'!I42","v":""},null,null,null,null,null,null,null,null,"2*21, SD 15"]
[null,null,null,"15:00:00","FINALE",32,null,{"$f":"'SCORE 16 PRINC'!H43","v":""},null,{"$f":"'SCORE 16 PRINC'!I43","v":""},null,null,null,null,null,null,null,null,"2*21, SD 15"]
[null,null,null,"16:00:00","PODIUM"]

{"sheet":"SCORE 16 PRINC","index":7,"n_rows":43,"n_cols":34,"rows_kept":43,"cut":false,"hidden":true,"merged":[]}
[]
[]
["DEBUT J1",0.375]
["TEMPS",2.0833333333333332E-2]
["DEBUT J2",0]
[]
[null,null,"PHASE","JOUR","N° MATCH","HEURE","TER","EQ1","EQ2","SCORE EQ1","SCORE EQ2","SET 1 EQ1","SET 1 EQ2","SET 2 EQ1","SET 2 EQ2","SET 3 EQ1","SET 3 EQ2","POS 1","POS 2",null,null,null,null,"PTS","S+","S-","P+","P-","CS","CP","CL.I","RG",null,"CLA"]
[null,null,"A",1,1,{"$f":"B3","v":"09:00:00"},1,{"$f":"'Poule 16 PS'!C14","v":"T / 1"},{"$f":"'Poule 16 PS'!C17","v":"T / 16"},{"$f":"SUM(IF(L8>M8,1,0),IF(N8>O8,1,0),IF(P8>Q8,1,0))","v":0},{"$f":"SUM(IF(M8>L8,1,0),IF(O8>N8,1,0),IF(Q8>P8,1,0))","v":0},{"$f":"'Poule 16 PS'!M13","v":0},{"$f":"'Poule 16 PS'!O13","v":0},{"$f":"'Poule 16 PS'!Q13","v":0},{"$f":"'Poule 16 PS'!S13","v":0},{"$f":"'Poule 16 PS'!U13","v":0},{"$f":"'Poule 16 PS'!W13","v":0},{"$f":"IF(J8=K8,\"\",IF(J8>K8,H8,I8))","v":""},{"$f":"IF(J8=K8,\"\",IF(J8<K8,H8,I8))","v":""},null,null,null,{"$f":"'Poule 16 PS'!C14","v":"T / 1"},{"$f":"COUNTIF(PLACE1,W8)*2+COUNTIF(PLACE2,W8)","v":0},{"$f":"SUMIF(LISTEE1,W8,(SCEQ1))+SUMIF(LISTEE2,W8,(SCEQ2))","v":0},{"$f":"SUMIF(LISTEE1,W8,(SCEQ2))+SUMIF(LISTEE2,W8,(SCEQ1))","v":0},{"$f":"(SUMPRODUCT((LISTEE1=W8)*((S1EQ1)+(S2EQ1)+(S3EQ1))))+(SUMPRODUCT((LISTEE2=W8)*((S1EQ2)+(S2EQ2)+(S3EQ3))))","v":0},{"$f":"(SUMPRODUCT((LISTEE2=W8)*((S1EQ1)+(S2EQ1)+(S3EQ1))))+(SUMPRODUCT((LISTEE1=W8)*((S1EQ2)+(S2EQ2)+(S3EQ3))))","v":0},{"$f":"IFERROR(Y8/Z8,0)","v":0},{"$f":"IFERROR(AA8/AB8,0)","v":0},{"$f":"X8+AC8/100+AD8/100","v":0},{"$f":"IF(X8=0,\"\",RANK(AE8,$AE$8:$AE$11))","v":""},1,{"$f":"IF(X8=0,\"\",IF($AF$8=AG8,$W$8,IF($AF$9=AG8,$W$9,IF($AF$10=AG8,$W$10,IF($AF$11=AG8,$W$11)))))","v":""}]
[null,null,"B",1,2,{"$f":"B3","v":"09:00:00"},2,{"$f":"'Poule 16 PS'!C21","v":"T / 2"},{"$f":"'Poule 16 PS'!C24","v":"T / 15"},0,0,{"$f":"'Poule 16 PS'!M20","v":0},{"$f":"'Poule 16 PS'!O20","v":0},{"$f":"'Poule 16 PS'!Q20","v":0},{"$f":"'Poule 16 PS'!S20","v":0},{"$f":"'Poule 16 PS'!U20","v":0},{"$f":"'Poule 16 PS'!W20","v":0},{"$f":"IF(J9=K9,\"\",IF(J9>K9,H9,I9))","v":""},{"$f":"IF(J9=K9,\"\",IF(J9<K9,H9,I9))","v":""},null,null,null,{"$f":"'Poule 16 PS'!C15","v":"T / 8"},{"$f":"COUNTIF(PLACE1,W9)*2+COUNTIF(PLACE2,W9)","v":0},{"$f":"SUMIF(LISTEE1,W9,(SCEQ1))+SUMIF(LISTEE2,W9,(SCEQ2))","v":0},{"$f":"SUMIF(LISTEE1,W9,(SCEQ2))+SUMIF(LISTEE2,W9,(SCEQ1))","v":0},{"$f":"(SUMPRODUCT((LISTEE1=W9)*((S1EQ1)+(S2EQ1)+(S3EQ1))))+(SUMPRODUCT((LISTEE2=W9)*((S1EQ2)+(S2EQ2)+(S3EQ3))))","v":0},{"$f":"(SUMPRODUCT((LISTEE2=W9)*((S1EQ1)+(S2EQ1)+(S3EQ1))))+(SUMPRODUCT((LISTEE1=W9)*((S1EQ2)+(S2EQ2)+(S3EQ3))))","v":0},{"$f":"IFERROR(Y9/Z9,0)","v":0},{"$f":"IFERROR(AA9/AB9,0)","v":0},{"$f":"X9+AC9/100+AD9/100","v":0},{"$f":"IF(X9=0,\"\",RANK(AE9,$AE$8:$AE$11))","v":""},2,{"$f":"IF(X9=0,\"\",IF($AF$8=AG9,$W$8,IF($AF$9=AG9,$W$9,IF($AF$10=AG9,$W$10,IF($AF$11=AG9,$W$11)))))","v":""}]
[null,null,"C",1,3,{"$f":"F8+$B$4","v":"09:30:00"},1,{"$f":"'Poule 16 PS'!C28","v":"T / 3"},{"$f":"'Poule 16 PS'!C31","v":"T / 14"},0,0,{"$f":"'Poule 16 PS'!M27","v":0},{"$f":"'Poule 16 PS'!O27","v":0},{"$f":"'Poule 16 PS'!Q27","v":0},{"$f":"'Poule 16 PS'!S27","v":0},{"$f":"'Poule 16 PS'!U27","v":0},{"$f":"'Poule 16 PS'!W27","v":0},{"$f":"IF(J10=K10,\"\",IF(J10>K10,H10,I10))","v":""},{"$f":"IF(J10=K10,\"\",IF(J10<K10,H10,I10))","v":""},null,null,null,{"$f":"'Poule 16 PS'!C16","v":"T / 9"},{"$f":"COUNTIF(PLACE1,W10)*2+COUNTIF(PLACE2,W10)","v":0},{"$f":"SUMIF(LISTEE1,W10,(SCEQ1))+SUMIF(LISTEE2,W10,(SCEQ2))","v":0},{"$f":"SUMIF(LISTEE1,W10,SCEQ2)+SUMIF(LISTEE2,W10,SCEQ1)","v":0},{"$f":"(SUMPRODUCT((LISTEE1=W10)*((S1EQ1)+(S2EQ1)+(S3EQ1))))+(SUMPRODUCT((LISTEE2=W10)*((S1EQ2)+(S2EQ2)+(S3EQ3))))","v":0},{"$f":"(SUMPRODUCT((LISTEE2=W10)*((S1EQ1)+(S2EQ1)+(S3EQ1))))+(SUMPRODUCT((LISTEE1=W10)*((S1EQ2)+(S2EQ2)+(S3EQ3))))","v":0},0,0,0,{"$f":"IF(X10=0,\"\",RANK(AE10,$AE$8:$AE$11))","v":""},3,{"$f":"IF(X10=0,\"\",IF($AF$8=AG10,$W$8,IF($AF$9=AG10,$W$9,IF($AF$10=AG10,$W$10,IF($AF$11=AG10,$W$11)))))","v":""}]
[null,null,"D",1,4,"09:30:00",2,{"$f":"'Poule 16 PS'!C35","v":"T / 4"},{"$f":"'Poule 16 PS'!C38","v":"T / 13"},0,0,{"$f":"'Poule 16 PS'!M34","v":0},{"$f":"'Poule 16 PS'!O34","v":0},{"$f":"'Poule 16 PS'!Q34","v":0},{"$f":"'Poule 16 PS'!S34","v":0},{"$f":"'Poule 16 PS'!U34","v":0},{"$f":"'Poule 16 PS'!W34","v":0},"","",null,null,null,{"$f":"'Poule 16 PS'!C17","v":"T / 16"},{"$f":"COUNTIF(PLACE1,W11)*2+COUNTIF(PLACE2,W11)","v":0},{"$f":"SUMIF(LISTEE1,W11,(SCEQ1))+SUMIF(LISTEE2,W11,(SCEQ2))","v":0},{"$f":"SUMIF(LISTEE1,W11,SCEQ2)+SUMIF(LISTEE2,W11,SCEQ1)","v":0},{"$f":"(SUMPRODUCT((LISTEE1=W11)*((S1EQ1)+(S2EQ1)+(S3EQ1))))+(SUMPRODUCT((LISTEE2=W11)*((S1EQ2)+(S2EQ2)+(S3EQ3))))","v":0},{"$f":"(SUMPRODUCT((LISTEE2=W11)*((S1EQ1)+(S2EQ1)+(S3EQ1))))+(SUMPRODUCT((LISTEE1=W11)*((S1EQ2)+(S2EQ2)+(S3EQ3))))","v":0},0,0,0,{"$f":"IF(X11=0,\"\",RANK(AE11,$AE$8:$AE$11))","v":""},4,{"$f":"IF(X11=0,\"\",IF($AF$8=AG11,$W$8,IF($AF$9=AG11,$W$9,IF($AF$10=AG11,$W$10,IF($AF$11=AG11,$W$11)))))","v":""}]
[null,null,"A",1,5,"10:00:00",1,{"$f":"'Poule 16 PS'!C15","v":"T / 8"},{"$f":"'Poule 16 PS'!C16","v":"T / 9"},0,0,{"$f":"'Poule 16 PS'!M14","v":0},{"$f":"'Poule 16 PS'!O14","v":0},{"$f":"'Poule 16 PS'!Q14","v":0},{"$f":"'Poule 16 PS'!S14","v":0},{"$f":"'Poule 16 PS'!U14","v":0},{"$f":"'Poule 16 PS'!W14","v":0},"",""]
[null,null,"B",1,6,"10:00:00",2,{"$f":"'Poule 16 PS'!C22","v":"T / 7"},{"$f":"'Poule 16 PS'!C23","v":"T / 10"},0,0,{"$f":"'Poule 16 PS'!M21","v":0},{"$f":"'Poule 16 PS'!O21","v":0},{"$f":"'Poule 16 PS'!Q21","v":0},{"$f":"'Poule 16 PS'!S21","v":0},{"$f":"'Poule 16 PS'!U21","v":0},{"$f":"'Poule 16 PS'!W21","v":0},"","",null,null,null,{"$f":"'Poule 16 PS'!C21","v":"T / 2"},{"$f":"COUNTIF(PLACE1,W13)*2+COUNTIF(PLACE2,W13)","v":0},{"$f":"SUMIF(LISTEE1,W13,(SCEQ1))+SUMIF(LISTEE2,W13,(SCEQ2))","v":0},{"$f":"SUMIF(LISTEE1,W13,SCEQ2)+SUMIF(LISTEE2,W13,SCEQ1)","v":0},{"$f":"(SUMPRODUCT((LISTEE1=W13)*((S1EQ1)+(S2EQ1)+(S3EQ1))))+(SUMPRODUCT((LISTEE2=W13)*((S1EQ2)+(S2EQ2)+(S3EQ3))))","v":0},{"$f":"(SUMPRODUCT((LISTEE2=W13)*((S1EQ1)+(S2EQ1)+(S3EQ1))))+(SUMPRODUCT((LISTEE1=W13)*((S1EQ2)+(S2EQ2)+(S3EQ3))))","v":0},0,0,0,{"$f":"IF(X13=0,\"\",RANK(AE13,$AE$13:$AE$16))","v":""},1,{"$f":"IF(X13=0,\"\",IF($AF$13=AG13,$W$13,IF($AF$14=AG13,$W$14,IF($AF$15=AG13,$W$15,IF($AF$16=AG13,$W$16)))))","v":""}]
[null,null,"C",1,7,"10:30:00",1,{"$f":"'Poule 16 PS'!C29","v":"T / 6"},{"$f":"'Poule 16 PS'!C30","v":"T / 11"},0,0,{"$f":"'Poule 16 PS'!M28","v":0},{"$f":"'Poule 16 PS'!O28","v":0},{"$f":"'Poule 16 PS'!Q28","v":0},{"$f":"'Poule 16 PS'!S28","v":0},{"$f":"'Poule 16 PS'!U28","v":0},{"$f":"'Poule 16 PS'!W28","v":0},{"$f":"IF(J14=K14,\"\",IF(J14>K14,H14,I14))","v":""},"",null,null,null,{"$f":"'Poule 16 PS'!C22","v":"T / 7"},{"$f":"COUNTIF(PLACE1,W14)*2+COUNTIF(PLACE2,W14)","v":0},{"$f":"SUMIF(LISTEE1,W14,(SCEQ1))+SUMIF(LISTEE2,W14,(SCEQ2))","v":0},{"$f":"SUMIF(LISTEE1,W14,SCEQ2)+SUMIF(LISTEE2,W14,SCEQ1)","v":0},{"$f":"(SUMPRODUCT((LISTEE1=W14)*((S1EQ1)+(S2EQ1)+(S3EQ1))))+(SUMPRODUCT((LISTEE2=W14)*((S1EQ2)+(S2EQ2)+(S3EQ3))))","v":0},{"$f":"(SUMPRODUCT((LISTEE2=W14)*((S1EQ1)+(S2EQ1)+(S3EQ1))))+(SUMPRODUCT((LISTEE1=W14)*((S1EQ2)+(S2EQ2)+(S3EQ3))))","v":0},0,0,0,{"$f":"IF(X14=0,\"\",RANK(AE14,$AE$13:$AE$16))","v":""},2,{"$f":"IF(X14=0,\"\",IF($AF$13=AG14,$W$13,IF($AF$14=AG14,$W$14,IF($AF$15=AG14,$W$15,IF($AF$16=AG14,$W$16)))))","v":""}]
[null,null,"D",1,8,"10:30:00",2,{"$f":"'Poule 16 PS'!C36","v":"T / 5"},{"$f":"'Poule 16 PS'!C37","v":"T /12"},0,0,{"$f":"'Poule 16 PS'!M35","v":0},{"$f":"'Poule 16 PS'!O35","v":0},{"$f":"'Poule 16 PS'!Q35","v":0},{"$f":"'Poule 16 PS'!S35","v":0},{"$f":"'Poule 16 PS'!U35","v":0},{"$f":"'Poule 16 PS'!W35","v":0},"","",null,null,null,{"$f":"'Poule 16 PS'!C23","v":"T / 10"},{"$f":"COUNTIF(PLACE1,W15)*2+COUNTIF(PLACE2,W15)","v":0},{"$f":"SUMIF(LISTEE1,W15,(SCEQ1))+SUMIF(LISTEE2,W15,(SCEQ2))","v":0},{"$f":"SUMIF(LISTEE1,W15,SCEQ2)+SUMIF(LISTEE2,W15,SCEQ1)","v":0},{"$f":"(SUMPRODUCT((LISTEE1=W15)*((S1EQ1)+(S2EQ1)+(S3EQ1))))+(SUMPRODUCT((LISTEE2=W15)*((S1EQ2)+(S2EQ2)+(S3EQ3))))","v":0},{"$f":"(SUMPRODUCT((LISTEE2=W15)*((S1EQ1)+(S2EQ1)+(S3EQ1))))+(SUMPRODUCT((LISTEE1=W15)*((S1EQ2)+(S2EQ2)+(S3EQ3))))","v":0},0,0,0,{"$f":"IF(X15=0,\"\",RANK(AE15,$AE$13:$AE$16))","v":""},3,{"$f":"IF(X15=0,\"\",IF($AF$13=AG15,$W$13,IF($AF$14=AG15,$W$14,IF($AF$15=AG15,$W$15,IF($AF$16=AG15,$W$16)))))","v":""}]
[null,null,"A",1,9,"11:00:00",1,{"$f":"'Poule QUALIF 16 P+B'!C15","v":"T / 8"},{"$f":"'Poule QUALIF 16 P+B'!C17","v":"T / 16"},0,0,{"$f":"'Poule 16 PS'!M15","v":0},{"$f":"'Poule 16 PS'!O15","v":0},{"$f":"'Poule 16 PS'!Q15","v":0},{"$f":"'Poule 16 PS'!S15","v":0},{"$f":"'Poule 16 PS'!U15","v":0},{"$f":"'Poule 16 PS'!W15","v":0},"","",null,null,null,{"$f":"'Poule 16 PS'!C24","v":"T / 15"},{"$f":"COUNTIF(PLACE1,W16)*2+COUNTIF(PLACE2,W16)","v":0},{"$f":"SUMIF(LISTEE1,W16,(SCEQ1))+SUMIF(LISTEE2,W16,(SCEQ2))","v":0},{"$f":"SUMIF(LISTEE1,W16,SCEQ2)+SUMIF(LISTEE2,W16,SCEQ1)","v":0},{"$f":"(SUMPRODUCT((LISTEE1=W16)*((S1EQ1)+(S2EQ1)+(S3EQ1))))+(SUMPRODUCT((LISTEE2=W16)*((S1EQ2)+(S2EQ2)+(S3EQ3))))","v":0},{"$f":"(SUMPRODUCT((LISTEE2=W16)*((S1EQ1)+(S2EQ1)+(S3EQ1))))+(SUMPRODUCT((LISTEE1=W16)*((S1EQ2)+(S2EQ2)+(S3EQ3))))","v":0},0,0,0,{"$f":"IF(X16=0,\"\",RANK(AE16,$AE$13:$AE$16))","v":""},4,{"$f":"IF(X16=0,\"\",IF($AF$13=AG16,$W$13,IF($AF$14=AG16,$W$14,IF($AF$15=AG16,$W$15,IF($AF$16=AG16,$W$16)))))","v":""}]
[null,null,"B",1,10,"11:00:00",2,{"$f":"'Poule 16 PS'!C22","v":"T / 7"},{"$f":"'Poule 16 PS'!C24","v":"T / 15"},0,0,{"$f":"'Poule 16 PS'!M22","v":0},{"$f":"'Poule 16 PS'!O22","v":0},{"$f":"'Poule 16 PS'!Q22","v":0},{"$f":"'Poule 16 PS'!S22","v":0},{"$f":"'Poule 16 PS'!U22","v":0},{"$f":"'Poule 16 PS'!W22","v":0},"",""]
[null,null,"C",1,11,"11:30:00",1,{"$f":"'Poule 16 PS'!C29","v":"T / 6"},{"$f":"'Poule 16 PS'!C31","v":"T / 14"},0,0,{"$f":"'Poule 16 PS'!M29","v":0},{"$f":"'Poule 16 PS'!O29","v":0},{"$f":"'Poule 16 PS'!Q29","v":0},{"$f":"'Poule 16 PS'!S29","v":0},{"$f":"'Poule 16 PS'!U29","v":0},{"$f":"'Poule 16 PS'!W29","v":0},"","",null,null,null,{"$f":"'Poule 16 PS'!C28","v":"T / 3"},{"$f":"COUNTIF(PLACE1,W18)*2+COUNTIF(PLACE2,W18)","v":0},{"$f":"SUMIF(LISTEE1,W18,(SCEQ1))+SUMIF(LISTEE2,W18,(SCEQ2))","v":0},{"$f":"SUMIF(LISTEE1,W18,SCEQ2)+SUMIF(LISTEE2,W18,SCEQ1)","v":0},{"$f":"(SUMPRODUCT((LISTEE1=W18)*((S1EQ1)+(S2EQ1)+(S3EQ1))))+(SUMPRODUCT((LISTEE2=W18)*((S1EQ2)+(S2EQ2)+(S3EQ3))))","v":0},{"$f":"(SUMPRODUCT((LISTEE2=W18)*((S1EQ1)+(S2EQ1)+(S3EQ1))))+(SUMPRODUCT((LISTEE1=W18)*((S1EQ2)+(S2EQ2)+(S3EQ3))))","v":0},{"$f":"IFERROR(Y18/Z18,0)","v":0},0,{"$f":"X18+AC18/100+AD18/100","v":0},{"$f":"IF(X18=0,\"\",RANK(AE18,$AE$18:$AE$21))","v":""},1,{"$f":"IF(X18=0,\"\",IF($AF$18=AG18,$W$18,IF($AF$19=AG18,$W$19,IF($AF$20=AG18,$W$20,IF($AF$21=AG18,$W$21)))))","v":""}]
[null,null,"D",1,12,"11:30:00",2,{"$f":"'Poule 16 PS'!C36","v":"T / 5"},{"$f":"'Poule 16 PS'!C38","v":"T / 13"},0,0,{"$f":"'Poule 16 PS'!M36","v":0},{"$f":"'Poule 16 PS'!O36","v":0},{"$f":"'Poule 16 PS'!Q36","v":0},{"$f":"'Poule 16 PS'!S36","v":0},{"$f":"'Poule 16 PS'!U36","v":0},{"$f":"'Poule 16 PS'!W36","v":0},"","",null,null,null,{"$f":"'Poule 16 PS'!C29","v":"T / 6"},{"$f":"COUNTIF(PLACE1,W19)*2+COUNTIF(PLACE2,W19)","v":0},{"$f":"SUMIF(LISTEE1,W19,(SCEQ1))+SUMIF(LISTEE2,W19,(SCEQ2))","v":0},{"$f":"SUMIF(LISTEE1,W19,SCEQ2)+SUMIF(LISTEE2,W19,SCEQ1)","v":0},{"$f":"(SUMPRODUCT((LISTEE1=W19)*((S1EQ1)+(S2EQ1)+(S3EQ1))))+(SUMPRODUCT((LISTEE2=W19)*((S1EQ2)+(S2EQ2)+(S3EQ3))))","v":0},{"$f":"(SUMPRODUCT((LISTEE2=W19)*((S1EQ1)+(S2EQ1)+(S3EQ1))))+(SUMPRODUCT((LISTEE1=W19)*((S1EQ2)+(S2EQ2)+(S3EQ3))))","v":0},0,0,{"$f":"X19+AC19/100+AD19/100","v":0},{"$f":"IF(X19=0,\"\",RANK(AE19,$AE$18:$AE$21))","v":""},2,{"$f":"IF(X19=0,\"\",IF($AF$18=AG19,$W$18,IF($AF$19=AG19,$W$19,IF($AF$20=AG19,$W$20,IF($AF$21=AG19,$W$21)))))","v":""}]
[null,null,"A",1,13,"12:00:00",1,{"$f":"'Poule 16 PS'!C14","v":"T / 1"},{"$f":"'Poule 16 PS'!C16","v":"T / 9"},0,0,{"$f":"'Poule 16 PS'!M16","v":0},{"$f":"'Poule 16 PS'!O16","v":0},{"$f":"'Poule 16 PS'!Q16","v":0},{"$f":"'Poule 16 PS'!S16","v":0},{"$f":"'Poule 16 PS'!U16","v":0},{"$f":"'Poule 16 PS'!W16","v":0},{"$f":"IF(J20=K20,\"\",IF(J20>K20,H20,I20))","v":""},{"$f":"IF(J20=K20,\"\",IF(J20<K20,H20,I20))","v":""},null,null,null,{"$f":"'Poule 16 PS'!C30","v":"T / 11"},{"$f":"COUNTIF(PLACE1,W20)*2+COUNTIF(PLACE2,W20)","v":0},{"$f":"SUMIF(LISTEE1,W20,(SCEQ1))+SUMIF(LISTEE2,W20,(SCEQ2))","v":0},{"$f":"SUMIF(LISTEE1,W20,SCEQ2)+SUMIF(LISTEE2,W20,SCEQ1)","v":0},{"$f":"(SUMPRODUCT((LISTEE1=W20)*((S1EQ1)+(S2EQ1)+(S3EQ1))))+(SUMPRODUCT((LISTEE2=W20)*((S1EQ2)+(S2EQ2)+(S3EQ3))))","v":0},{"$f":"(SUMPRODUCT((LISTEE2=W20)*((S1EQ1)+(S2EQ1)+(S3EQ1))))+(SUMPRODUCT((LISTEE1=W20)*((S1EQ2)+(S2EQ2)+(S3EQ3))))","v":0},0,0,0,"",3,{"$f":"IF(X20=0,\"\",IF($AF$18=AG20,$W$18,IF($AF$19=AG20,$W$19,IF($AF$20=AG20,$W$20,IF($AF$21=AG20,$W$21)))))","v":""}]
[null,null,"B",1,14,"12:00:00",2,{"$f":"'Poule 16 PS'!C21","v":"T / 2"},{"$f":"'Poule 16 PS'!C23","v":"T / 10"},0,0,{"$f":"'Poule 16 PS'!M23","v":0},{"$f":"'Poule 16 PS'!O23","v":0},{"$f":"'Poule 16 PS'!Q23","v":0},{"$f":"'Poule 16 PS'!S23","v":0},{"$f":"'Poule 16 PS'!U23","v":0},{"$f":"'Poule 16 PS'!W23","v":0},"","",null,null,null,{"$f":"'Poule 16 PS'!C31","v":"T / 14"},{"$f":"COUNTIF(PLACE1,W21)*2+COUNTIF(PLACE2,W21)","v":0},{"$f":"SUMIF(LISTEE1,W21,(SCEQ1))+SUMIF(LISTEE2,W21,(SCEQ2))","v":0},{"$f":"SUMIF(LISTEE1,W21,SCEQ2)+SUMIF(LISTEE2,W21,SCEQ1)","v":0},{"$f":"(SUMPRODUCT((LISTEE1=W21)*((S1EQ1)+(S2EQ1)+(S3EQ1))))+(SUMPRODUCT((LISTEE2=W21)*((S1EQ2)+(S2EQ2)+(S3EQ3))))","v":0},{"$f":"(SUMPRODUCT((LISTEE2=W21)*((S1EQ1)+(S2EQ1)+(S3EQ1))))+(SUMPRODUCT((LISTEE1=W21)*((S1EQ2)+(S2EQ2)+(S3EQ3))))","v":0},0,0,{"$f":"X21+AC21/100+AD21/100","v":0},"",4,{"$f":"IF(X21=0,\"\",IF($AF$18=AG21,$W$18,IF($AF$19=AG21,$W$19,IF($AF$20=AG21,$W$20,IF($AF$21=AG21,$W$21)))))","v":""}]
[null,null,"C",1,15,"12:30:00",1,{"$f":"'Poule 16 PS'!C28","v":"T / 3"},{"$f":"'Poule 16 PS'!C30","v":"T / 11"},0,0,{"$f":"'Poule 16 PS'!M30","v":0},{"$f":"'Poule 16 PS'!O30","v":0},{"$f":"'Poule 16 PS'!Q30","v":0},{"$f":"'Poule 16 PS'!S30","v":0},{"$f":"'Poule 16 PS'!U30","v":0},{"$f":"'Poule 16 PS'!W30","v":0},"",""]
[null,null,"D",1,16,"12:30:00",2,{"$f":"'Poule 16 PS'!C35","v":"T / 4"},{"$f":"'Poule 16 PS'!C37","v":"T /12"},0,0,{"$f":"'Poule 16 PS'!M37","v":0},{"$f":"'Poule 16 PS'!O37","v":0},{"$f":"'Poule 16 PS'!Q37","v":0},{"$f":"'Poule 16 PS'!S37","v":0},{"$f":"'Poule 16 PS'!U37","v":0},{"$f":"'Poule 16 PS'!W37","v":0},"","",null,null,null,{"$f":"'Poule 16 PS'!C35","v":"T / 4"},{"$f":"COUNTIF(PLACE1,W23)*2+COUNTIF(PLACE2,W23)","v":0},{"$f":"SUMIF(LISTEE1,W23,(SCEQ1))+SUMIF(LISTEE2,W23,(SCEQ2))","v":0},{"$f":"SUMIF(LISTEE1,W23,SCEQ2)+SUMIF(LISTEE2,W23,SCEQ1)","v":0},{"$f":"(SUMPRODUCT((LISTEE1=W23)*((S1EQ1)+(S2EQ1)+(S3EQ1))))+(SUMPRODUCT((LISTEE2=W23)*((S1EQ2)+(S2EQ2)+(S3EQ3))))","v":0},{"$f":"(SUMPRODUCT((LISTEE2=W23)*((S1EQ1)+(S2EQ1)+(S3EQ1))))+(SUMPRODUCT((LISTEE1=W23)*((S1EQ2)+(S2EQ2)+(S3EQ3))))","v":0},0,0,0,{"$f":"IF(X23=0,\"\",RANK(AE23,$AE$23:$AE$26))","v":""},1,{"$f":"IF(X23=0,\"\",IF($AF$23=AG23,$W$23,IF($AF$24=AG23,$W$24,IF($AF$25=AG23,$W$25,IF($AF$26=AG23,$W$26)))))","v":""}]
[null,null,"A",1,17,"13:00:00",1,{"$f":"'Poule 16 PS'!C16","v":"T / 9"},{"$f":"'Poule 16 PS'!C17","v":"T / 16"},0,0,{"$f":"'Poule 16 PS'!M17","v":0},{"$f":"'Poule 16 PS'!O17","v":0},{"$f":"'Poule 16 PS'!Q17","v":0},{"$f":"'Poule 16 PS'!S17","v":0},{"$f":"'Poule 16 PS'!U17","v":0},{"$f":"'Poule 16 PS'!W17","v":0},{"$f":"IF(J24=K24,\"\",IF(J24>K24,H24,I24))","v":""},{"$f":"IF(J24=K24,\"\",IF(J24<K24,H24,I24))","v":""},null,null,null,{"$f":"'Poule 16 PS'!C36","v":"T / 5"},{"$f":"COUNTIF(PLACE1,W24)*2+COUNTIF(PLACE2,W24)","v":0},{"$f":"SUMIF(LISTEE1,W24,(SCEQ1))+SUMIF(LISTEE2,W24,(SCEQ2))","v":0},{"$f":"SUMIF(LISTEE1,W24,SCEQ2)+SUMIF(LISTEE2,W24,SCEQ1)","v":0},{"$f":"(SUMPRODUCT((LISTEE1=W24)*((S1EQ1)+(S2EQ1)+(S3EQ1))))+(SUMPRODUCT((LISTEE2=W24)*((S1EQ2)+(S2EQ2)+(S3EQ3))))","v":0},{"$f":"(SUMPRODUCT((LISTEE2=W24)*((S1EQ1)+(S2EQ1)+(S3EQ1))))+(SUMPRODUCT((LISTEE1=W24)*((S1EQ2)+(S2EQ2)+(S3EQ3))))","v":0},0,0,0,{"$f":"IF(X24=0,\"\",RANK(AE24,$AE$23:$AE$26))","v":""},2,{"$f":"IF(X24=0,\"\",IF($AF$23=AG24,$W$23,IF($AF$24=AG24,$W$24,IF($AF$25=AG24,$W$25,IF($AF$26=AG24,$W$26)))))","v":""}]
[null,null,"B",1,18,"13:00:00",2,{"$f":"'Poule 16 PS'!C23","v":"T / 10"},{"$f":"'Poule 16 PS'!C24","v":"T / 15"},0,0,{"$f":"'Poule 16 PS'!M24","v":0},{"$f":"'Poule 16 PS'!O24","v":0},{"$f":"'Poule 16 PS'!Q24","v":0},{"$f":"'Poule 16 PS'!S24","v":0},{"$f":"'Poule 16 PS'!U24","v":0},{"$f":"'Poule 16 PS'!W24","v":0},"","",null,null,null,{"$f":"'Poule 16 PS'!C37","v":"T /12"},{"$f":"COUNTIF(PLACE1,W25)*2+COUNTIF(PLACE2,W25)","v":0},{"$f":"SUMIF(LISTEE1,W25,(SCEQ1))+SUMIF(LISTEE2,W25,(SCEQ2))","v":0},{"$f":"SUMIF(LISTEE1,W25,SCEQ2)+SUMIF(LISTEE2,W25,SCEQ1)","v":0},{"$f":"(SUMPRODUCT((LISTEE1=W25)*((S1EQ1)+(S2EQ1)+(S3EQ1))))+(SUMPRODUCT((LISTEE2=W25)*((S1EQ2)+(S2EQ2)+(S3EQ3))))","v":0},{"$f":"(SUMPRODUCT((LISTEE2=W25)*((S1EQ1)+(S2EQ1)+(S3EQ1))))+(SUMPRODUCT((LISTEE1=W25)*((S1EQ2)+(S2EQ2)+(S3EQ3))))","v":0},0,0,0,"",3,""]
[null,null,"C",1,19,"13:30:00",1,{"$f":"'Poule 16 PS'!C30","v":"T / 11"},{"$f":"'Poule 16 PS'!C31","v":"T / 14"},0,0,{"$f":"'Poule 16 PS'!M31","v":0},{"$f":"'Poule 16 PS'!O31","v":0},{"$f":"'Poule 16 PS'!Q31","v":0},{"$f":"'Poule 16 PS'!S31","v":0},{"$f":"'Poule 16 PS'!U31","v":0},{"$f":"'Poule 16 PS'!W31","v":0},"","",null,null,null,{"$f":"'Poule 16 PS'!C38","v":"T / 13"},{"$f":"COUNTIF(PLACE1,W26)*2+COUNTIF(PLACE2,W26)","v":0},{"$f":"SUMIF(LISTEE1,W26,(SCEQ1))+SUMIF(LISTEE2,W26,(SCEQ2))","v":0},{"$f":"SUMIF(LISTEE1,W26,SCEQ2)+SUMIF(LISTEE2,W26,SCEQ1)","v":0},{"$f":"(SUMPRODUCT((LISTEE1=W26)*((S1EQ1)+(S2EQ1)+(S3EQ1))))+(SUMPRODUCT((LISTEE2=W26)*((S1EQ2)+(S2EQ2)+(S3EQ3))))","v":0},{"$f":"(SUMPRODUCT((LISTEE2=W26)*((S1EQ1)+(S2EQ1)+(S3EQ1))))+(SUMPRODUCT((LISTEE1=W26)*((S1EQ2)+(S2EQ2)+(S3EQ3))))","v":0},0,0,0,"",4,{"$f":"IF(X26=0,\"\",IF($AF$23=AG26,$W$23,IF($AF$24=AG26,$W$24,IF($AF$25=AG26,$W$25,IF($AF$26=AG26,$W$26)))))","v":""}]
[null,null,"D",1,20,"13:30:00",2,{"$f":"'Poule 16 PS'!C37","v":"T /12"},{"$f":"'Poule 16 PS'!C38","v":"T / 13"},0,0,{"$f":"'Poule 16 PS'!M38","v":0},{"$f":"'Poule 16 PS'!O38","v":0},{"$f":"'Poule 16 PS'!Q38","v":0},{"$f":"'Poule 16 PS'!S38","v":0},{"$f":"'Poule 16 PS'!U38","v":0},{"$f":"'Poule 16 PS'!W38","v":0},"",""]
[null,null,"A",1,21,"14:00:00",1,{"$f":"'Poule 16 PS'!C14","v":"T / 1"},{"$f":"'Poule 16 PS'!C15","v":"T / 8"},0,0,{"$f":"'Poule 16 PS'!M18","v":0},{"$f":"'Poule 16 PS'!O18","v":0},{"$f":"'Poule 16 PS'!Q18","v":0},{"$f":"'Poule 16 PS'!S18","v":0},{"$f":"'Poule 16 PS'!U18","v":0},{"$f":"'Poule 16 PS'!W18","v":0},{"$f":"IF(J28=K28,\"\",IF(J28>K28,H28,I28))","v":""},{"$f":"IF(J28=K28,\"\",IF(J28<K28,H28,I28))","v":""}]
[null,null,"B",1,22,"14:00:00",2,{"$f":"'Poule 16 PS'!C21","v":"T / 2"},{"$f":"'Poule 16 PS'!C22","v":"T / 7"},0,0,{"$f":"'Poule 16 PS'!M25","v":0},{"$f":"'Poule 16 PS'!O25","v":0},{"$f":"'Poule 16 PS'!Q25","v":0},{"$f":"'Poule 16 PS'!S25","v":0},{"$f":"'Poule 16 PS'!U25","v":0},{"$f":"'Poule 16 PS'!W25","v":0},"",""]
[null,null,"C",1,23,"14:30:00",1,{"$f":"'Poule 16 PS'!C28","v":"T / 3"},{"$f":"'Poule 16 PS'!C29","v":"T / 6"},0,0,{"$f":"'Poule 16 PS'!M32","v":0},{"$f":"'Poule 16 PS'!O32","v":0},{"$f":"'Poule 16 PS'!Q32","v":0},{"$f":"'Poule 16 PS'!S32","v":0},{"$f":"'Poule 16 PS'!U32","v":0},{"$f":"'Poule 16 PS'!W32","v":0},"",""]
[null,null,"D",1,24,"14:30:00",2,{"$f":"'Poule 16 PS'!C35","v":"T / 4"},{"$f":"'Poule 16 PS'!C36","v":"T / 5"},0,0,{"$f":"'Poule 16 PS'!M39","v":0},{"$f":"'Poule 16 PS'!O39","v":0},{"$f":"'Poule 16 PS'!Q39","v":0},{"$f":"'Poule 16 PS'!S39","v":0},{"$f":"'Poule 16 PS'!U39","v":0},{"$f":"'Poule 16 PS'!W39","v":0},{"$f":"IF(J31=K31,\"\",IF(J31>K31,H31,I31))","v":""},""]
[null,null,"BARR",1,25,"15:00:00",1,{"$f":"'Poule 16 PS'!AD13","v":""},{"$f":"'Poule 16 PS'!AD16","v":""},{"$f":"SUM(IF(L32>M32,1,0),IF(N32>O32,1,0),IF(P32>Q32,1,0))","v":0},0,{"$f":"'Poule 16 PS'!AG14","v":0},{"$f":"'Poule 16 PS'!AI14","v":0},{"$f":"'Poule 16 PS'!AK14","v":0},{"$f":"'Poule 16 PS'!AM14","v":0},{"$f":"'Poule 16 PS'!AO14","v":0},{"$f":"'Poule 16 PS'!AQ14","v":0},{"$f":"IF(J32=K32,\"\",IF(J32>K32,H32,I32))","v":""},{"$f":"IF(J32=K32,\"\",IF(J32<K32,H32,I32))","v":""}]
[null,null,"BARR",1,26,"15:00:00",2,{"$f":"'Poule 16 PS'!AD19","v":""},{"$f":"'Poule 16 PS'!AD22","v":""},{"$f":"SUM(IF(L33>M33,1,0),IF(N33>O33,1,0),IF(P33>Q33,1,0))","v":0},{"$f":"SUM(IF(M33>L33,1,0),IF(O33>N33,1,0),IF(Q33>P33,1,0))","v":0},{"$f":"'Poule 16 PS'!AG20","v":0},{"$f":"'Poule 16 PS'!AI20","v":0},{"$f":"'Poule 16 PS'!AK20","v":0},{"$f":"'Poule 16 PS'!AM20","v":0},{"$f":"'Poule 16 PS'!AO20","v":0},{"$f":"'Poule 16 PS'!AQ20","v":0},{"$f":"IF(J33=K33,\"\",IF(J33>K33,H33,I33))","v":""},""]
[null,null,"BARR",1,27,"15:30:00",1,{"$f":"'Poule 16 PS'!AD25","v":""},{"$f":"'Poule 16 PS'!AD28","v":""},0,0,{"$f":"'Poule 16 PS'!AG26","v":0},{"$f":"'Poule 16 PS'!AI26","v":0},{"$f":"'Poule 16 PS'!AK26","v":0},{"$f":"'Poule 16 PS'!AM26","v":0},{"$f":"'Poule 16 PS'!AO26","v":0},{"$f":"'Poule 16 PS'!AQ26","v":0},"",""]
[null,null,"BARR",1,28,"15:30:00",2,{"$f":"'Poule 16 PS'!AD31","v":""},{"$f":"'Poule 16 PS'!AD34","v":""},{"$f":"SUM(IF(L35>M35,1,0),IF(N35>O35,1,0),IF(P35>Q35,1,0))","v":0},0,{"$f":"'Poule 16 PS'!AG32","v":0},{"$f":"'Poule 16 PS'!AI32","v":0},{"$f":"'Poule 16 PS'!AK32","v":0},{"$f":"'Poule 16 PS'!AM32","v":0},{"$f":"'Poule 16 PS'!AO32","v":0},{"$f":"'Poule 16 PS'!AQ32","v":0},"",""]
[null,null,"1/4",1,29,"16:00:00",1,{"$f":"AH8","v":""},{"$f":"R32","v":""},{"$f":"SUM(IF(L36>M36,1,0),IF(N36>O36,1,0),IF(P36>Q36,1,0))","v":0},{"$f":"SUM(IF(M36>L36,1,0),IF(O36>N36,1,0),IF(Q36>P36,1,0))","v":0},{"$f":"'Poule 16 PS'!M45","v":0},{"$f":"'Poule 16 PS'!O45","v":0},{"$f":"'Poule 16 PS'!Q45","v":0},{"$f":"'Poule 16 PS'!S45","v":0},{"$f":"'Poule 16 PS'!U45","v":0},{"$f":"'Poule 16 PS'!W45","v":0},"",""]
[null,null,"1/4",1,30,"16:00:00",2,{"$f":"R33","v":""},{"$f":"AH23","v":""},0,0,{"$f":"'Poule 16 PS'!M51","v":0},{"$f":"'Poule 16 PS'!O51","v":0},{"$f":"'Poule 16 PS'!Q51","v":0},{"$f":"'Poule 16 PS'!S51","v":0},{"$f":"'Poule 16 PS'!U51","v":0},{"$f":"'Poule 16 PS'!W51","v":0},"",""]
[null,null,"1/4",1,31,"16:30:00",1,{"$f":"AH18","v":""},{"$f":"R34","v":""},0,0,{"$f":"'Poule 16 PS'!M57","v":0},{"$f":"'Poule 16 PS'!O57","v":0},{"$f":"'Poule 16 PS'!Q57","v":0},{"$f":"'Poule 16 PS'!S57","v":0},{"$f":"'Poule 16 PS'!U57","v":0},{"$f":"'Poule 16 PS'!W57","v":0},"",""]
[null,null,"1/4",1,32,"16:30:00",2,{"$f":"R35","v":""},{"$f":"AH13","v":""},0,0,{"$f":"'Poule 16 PS'!M63","v":0},{"$f":"'Poule 16 PS'!O63","v":0},{"$f":"'Poule 16 PS'!Q63","v":0},{"$f":"'Poule 16 PS'!S63","v":0},{"$f":"'Poule 16 PS'!U63","v":0},{"$f":"'Poule 16 PS'!W63","v":0},"",""]
[null,null,"1/2",1,33,"17:00:00",null,{"$f":"R36","v":""},{"$f":"R37","v":""},{"$f":"SUM(IF(L40>M40,1,0),IF(N40>O40,1,0),IF(P40>Q40,1,0))","v":0},{"$f":"SUM(IF(M40>L40,1,0),IF(O40>N40,1,0),IF(Q40>P40,1,0))","v":0},{"$f":"'Poule 16 PS'!AI45","v":0},{"$f":"'Poule 16 PS'!AK45","v":0},{"$f":"'Poule 16 PS'!AM45","v":0},{"$f":"'Poule 16 PS'!AO45","v":0},{"$f":"'Poule 16 PS'!AQ45","v":0},{"$f":"'Poule 16 PS'!AS45","v":0},"",""]
[null,null,"1/2",1,34,{"$f":"F40+$B$4","v":"17:30:00"},null,{"$f":"R39","v":""},{"$f":"R38","v":""},{"$f":"SUM(IF(L41>M41,1,0),IF(N41>O41,1,0),IF(P41>Q41,1,0))","v":0},{"$f":"SUM(IF(M41>L41,1,0),IF(O41>N41,1,0),IF(Q41>P41,1,0))","v":0},{"$f":"'Poule 16 PS'!AI51","v":0},{"$f":"'Poule 16 PS'!AK51","v":0},{"$f":"'Poule 16 PS'!AM51","v":0},{"$f":"'Poule 16 PS'!AO51","v":0},{"$f":"'Poule 16 PS'!AQ51","v":0},{"$f":"'Poule 16 PS'!AS51","v":0},"",""]
[null,null,"3-4",1,35,{"$f":"F41+$B$4","v":"18:00:00"},null,{"$f":"S40","v":""},{"$f":"S41","v":""},0,0,{"$f":"'Poule 16 PS'!AI59","v":0},{"$f":"'Poule 16 PS'!AK59","v":0},{"$f":"'Poule 16 PS'!AM59","v":0},{"$f":"'Poule 16 PS'!AO59","v":0},{"$f":"'Poule 16 PS'!AQ59","v":0},{"$f":"'Poule 16 PS'!AS59","v":0},"",""]
[null,null,"F",1,36,{"$f":"F42+$B$4","v":"18:30:00"},null,{"$f":"R40","v":""},{"$f":"R41","v":""},{"$f":"SUM(IF(L43>M43,1,0),IF(N43>O43,1,0),IF(P43>Q43,1,0))","v":0},{"$f":"SUM(IF(M43>L43,1,0),IF(O43>N43,1,0),IF(Q43>P43,1,0))","v":0},{"$f":"'Poule 16 PS'!BA48","v":0},{"$f":"'Poule 16 PS'!BC48","v":0},{"$f":"'Poule 16 PS'!BE48","v":0},{"$f":"'Poule 16 PS'!BG48","v":0},{"$f":"'Poule 16 PS'!BI48","v":0},{"$f":"'Poule 16 PS'!BK48","v":0},"",""]

{"sheet":"Poule 16 PS","index":8,"n_rows":65,"n_cols":62,"rows_kept":65,"cut":false,"hidden":false,"merged":[[46,29,46,31],[11,3,11,5],[4,23,4,25],[4,6,4,16],[49,12,49,14],[49,16,49,18],[49,20,49,22],[51,12,51,14],[51,16,51,18],[51,20,51,22],[11,12,11,14],[11,16,11,18],[11,20,11,22],[43,12,43,14],[43,16,43,18],[43,20,43,22],[45,12,45,14],[45,16,45,18],[45,20,45,22],[46,12,46,14],[46,16,46,18],[46,20,46,22],[49,29,49,31],[57,20,57,22],[58,12,58,14],[58,16,58,18],[58,20,58,22],[52,12,52,14],[52,16,52,18],[52,20,52,22],[55,12,55,14],[55,16,55,18],[55,20,55,22],[64,12,64,14],[64,16,64,18],[64,20,64,22],[41,7,41,8],[10,29,10,30],[41,29,41,30],[55,29,55,30],[43,7,43,9],[46,7,46,9],[49,7,49,9],[52,7,52,9],[55,7,55,9],[58,7,58,9],[61,7,61,9],[64,7,64,9],[43,29,43,31],[61,12,61,14],[61,16,61,18],[61,20,61,22],[63,12,63,14],[63,16,63,18],[63,20,63,22],[57,12,57,14],[57,16,57,18],[14,32,14,34],[15,32,15,34],[15,36,15,38],[15,40,15,42],[20,32,20,34],[26,36,26,38],[26,40,26,42],[20,36,20,38],[20,40,20,42],[14,36,14,38],[14,40,14,42],[18,32,18,34],[18,36,18,38],[18,40,18,42],[24,32,24,34],[24,36,24,38],[24,40,24,42],[30,32,30,34],[30,36,30,38],[30,40,30,42],[21,32,21,34],[21,36,21,38],[21,40,21,42],[26,32,26,34],[27,32,27,34],[27,36,27,38],[27,40,27,42],[43,34,43,36],[43,38,43,40],[43,42,43,44],[45,34,45,36],[45,38,45,40],[45,42,45,44],[32,32,32,34],[33,32,33,34],[33,36,33,38],[33,40,33,42],[32,36,32,38],[32,40,32,42],[48,56,48,58],[48,60,48,62],[51,34,51,36],[51,38,51,40],[51,42,51,44],[52,34,52,36],[52,38,52,40],[52,42,52,44],[46,34,46,36],[46,38,46,40],[46,42,46,44],[49,34,49,36],[49,38,49,40],[49,42,49,44],[52,29,52,31],[57,29,57,31],[60,29,60,31],[10,12,10,16],[46,52,46,54],[46,56,46,58],[46,60,46,62],[41,46,41,49],[46,46,46,49],[59,34,59,36],[59,38,59,40],[59,42,59,44],[60,34,60,36],[60,38,60,40],[60,42,60,44],[49,52,49,54],[49,56,49,58],[49,60,49,62],[57,34,57,36],[57,38,57,40],[57,42,57,44],[49,46,49,49],[48,52,48,54],[26,49,26,55],[27,49,27,55],[5,6,5,29],[6,6,6,29],[4,17,4,22],[0,26,4,29],[0,6,3,25],[21,49,21,55],[22,49,22,55],[23,49,23,55],[24,49,24,55],[25,49,25,55],[16,49,16,55],[17,49,17,55],[18,49,18,55],[19,49,19,55],[20,49,20,55],[10,49,10,54],[12,49,12,55],[13,49,13,55],[14,49,14,55],[15,49,15,55],[12,32,12,34],[12,36,12,38],[12,40,12,42]]}
[null,null,null,null,null,null,{"$f":"IF('LISTE ENGAGES'!Q3=\"\",'LISTE ENGAGES'!P3,'LISTE ENGAGES'!Q3)","v":"APPELATION TOURNOI"},null,null,null,null,null,null,null,null,null,null,null,null,null,null,null,null,null,null,null,{"$f":"'LISTE ENGAGES'!H1:H3","v":"ORGANISATEUR"}]
[]
[]
[]
[null,null,null,null,null,null,{"$f":"IF('LISTE ENGAGES'!Q4=\"\",'LISTE ENGAGES'!P4,'LISTE ENGAGES'!Q4)","v":"LIEU"},null,null,null,null,null,null,null,null,null,null,{"$f":"'LISTE ENGAGES'!F4","v":"DATE"},null,null,null,null,null,{"$f":"'LISTE ENGAGES'!H4","v":"GENRE"}]
[null,null,null,null,null,null,{"$f":"IF('LISTE ENGAGES'!Q5<>\"\",'LISTE ENGAGES'!Q5,'LISTE ENGAGES'!P5)","v":"TYPE"}]
[null,null,null,null,null,null,"TABLEAU PRINCIPAL"]
[]
[]
[]
[null,null,"POULES",null,null,null,null,null,null,null,null,null,"RESULTATS",null,null,null,null,null,null,null,null,null,null,null,null,null,"CLASS. POUL",null,null,"BARRAGES",null,null,null,null,null,null,null,null,null,null,null,null,null,null,null,null,null,null,null,"CLASSEMENT FINAL"]
[null,null,null,"ORDRE",null,null,"H ","T","A",null,"SCORE",null,"Set 1",null,null,null,"Set 2",null,null,null,"Set 3",null,null,null,null,"POULE"]
[null,null,null,"1-4",{"$f":"CONCATENATE(C14,\" - \",C17)","v":"T / 1 - T / 16"},"(1)",{"$f":"'PLANNING PS 16'!D17","v":"09:00:00"},null,null,null,{"$f":"CONCATENATE(\"(\",'SCORE 16 PRINC'!J8,\"/\",'SCORE 16 PRINC'!K8,\")\")","v":"(0/0)"},":",null,"/",null,";",null,"/",null,";",null,"/",null,null,null,null,null,null,null,{"$f":"AA23","v":""},"SCORE",null,"Set 1",null,null,null,"Set 2",null,null,null,"Set 3",null,null,null,null,null,null,null,"1 -",{"$f":"'SCORE 16 PRINC'!R43","v":""}]
[null,"T1",{"$f":"CONCATENATE('EMARG M Tableau PRIN'!C9,\" / \",'EMARG M Tableau PRIN'!G9)","v":"T / 1"},"2-3",{"$f":"CONCATENATE(C15,\" - \",C16)","v":"T / 8 - T / 9"},"(5)",null,null,null,null,{"$f":"CONCATENATE(\"(\",'SCORE 16 PRINC'!J12,\"/\",'SCORE 16 PRINC'!K12,\")\")","v":"(0/0)"},":",null,"/",null,";",null,"/",null,";",null,"/",null,null,null,1,{"$f":"'SCORE 16 PRINC'!AH8","v":""},null,null,"3B",{"$f":"CONCATENATE(\"(\",'SCORE 16 PRINC'!J32,\"/\",'SCORE 16 PRINC'!K32,\")\")","v":"(0/0)"},null,null,"/",null,null,null,"/",null,null,null,"/",null,null,null,null,null,null,"2 -",{"$f":"'SCORE 16 PRINC'!S43","v":""}]
["A","T8",{"$f":"CONCATENATE('EMARG M Tableau PRIN'!C16,\" / \",'EMARG M Tableau PRIN'!G16)","v":"T / 8"},"2-4",{"$f":"CONCATENATE(C15,\" - \",C17)","v":"T / 8 - T / 16"},"(9)",null,null,null,null,{"$f":"CONCATENATE(\"(\",'SCORE 16 PRINC'!J16,\"/\",'SCORE 16 PRINC'!K16,\")\")","v":"(0/0)"},":",null,"/",null,";",null,"/",null,";",null,"/",null,null,null,2,{"$f":"'SCORE 16 PRINC'!AH9","v":""},null,"(B1)","2C",null,null,"HEURE",null,null,null,"TERR",null,null,null,"ARB.",null,null,null,null,null,null,null,"3 -",{"$f":"'SCORE 16 PRINC'!R42","v":""}]
[null,"T9",{"$f":"CONCATENATE('EMARG M Tableau PRIN'!C17,\" / \",'EMARG M Tableau PRIN'!G17)","v":"T / 9"},"1-3",{"$f":"CONCATENATE(C14,\" - \",C16)","v":"T / 1 - T / 9"},"(13)",null,null,null,null,{"$f":"CONCATENATE(\"(\",'SCORE 16 PRINC'!J20,\"/\",'SCORE 16 PRINC'!K20,\")\")","v":"(0/0)"},":",null,"/",null,";",null,"/",null,";",null,"/",null,null,null,3,{"$f":"'SCORE 16 PRINC'!AH10","v":""},null,null,{"$f":"AA29","v":""},null,null,null,null,null,null,null,null,null,null,null,null,null,null,null,null,null,null,"4 -",{"$f":"'SCORE 16 PRINC'!S42","v":""}]
[null,"T16",{"$f":"CONCATENATE('EMARG M Tableau PRIN'!C24,\" / \",'EMARG M Tableau PRIN'!G24)","v":"T / 16"},"3-4",{"$f":"CONCATENATE(C16,\" - \",C17)","v":"T / 9 - T / 16"},"(17)",null,null,null,null,{"$f":"CONCATENATE(\"(\",'SCORE 16 PRINC'!J24,\"/\",'SCORE 16 PRINC'!K24,\")\")","v":"(0/0)"},":",null,"/",null,";",null,"/",null,";",null,"/",null,null,null,4,{"$f":"'SCORE 16 PRINC'!AH11","v":""},null,null,null,null,null,null,null,null,null,null,null,null,null,null,null,null,null,null,null,null,null,"5 -",{"$f":"'SCORE 16 PRINC'!S36","v":""}]
[null,null,null,"1-2",{"$f":"CONCATENATE(C14,\" - \",C15)","v":"T / 1 - T / 8"},"(21)",null,null,null,null,{"$f":"CONCATENATE(\"(\",'SCORE 16 PRINC'!J28,\"/\",'SCORE 16 PRINC'!K28,\")\")","v":"(0/0)"},":",null,"/",null,";",null,"/",null,";",null,"/",null,null,null,null,null,null,null,null,null,null,null,null,null,null,null,null,null,null,null,null,null,null,null,null,null,null,"6 -",{"$f":"'SCORE 16 PRINC'!S37","v":""}]
[null,null,null,null,null,null,null,null,null,null,null,null,null,null,null,null,null,null,null,null,null,null,null,null,null,null,null,null,null,{"$f":"AA30","v":""},"SCORE",null,"Set 1",null,null,null,"Set 2",null,null,null,"Set 3",null,null,null,null,null,null,null,"7 -",{"$f":"'SCORE 16 PRINC'!S38","v":""}]
[null,null,null,"1-4",{"$f":"CONCATENATE(C21,\" - \",C24)","v":"T / 2 - T / 15"},"(3)",null,null,null,null,{"$f":"CONCATENATE(\"(\",'SCORE 16 PRINC'!J9,\"/\",'SCORE 16 PRINC'!K9,\")\")","v":"(0/0)"},":",null,"/",null,";",null,"/",null,";",null,"/",null,null,null,null,null,null,null,"3C",{"$f":"CONCATENATE(\"(\",'SCORE 16 PRINC'!J33,\"/\",'SCORE 16 PRINC'!K33,\")\")","v":"(0/0)"},null,null,"/",null,null,null,"/",null,null,null,"/",null,null,null,null,null,null,"8 -",{"$f":"'SCORE 16 PRINC'!S39","v":""}]
[null,"T2",{"$f":"CONCATENATE('EMARG M Tableau PRIN'!C10,\" / \",'EMARG M Tableau PRIN'!G10)","v":"T / 2"},"2-3",{"$f":"CONCATENATE(C22,\" - \",C23)","v":"T / 7 - T / 10"},"(7)",null,null,null,null,{"$f":"CONCATENATE(\"(\",'SCORE 16 PRINC'!J13,\"/\",'SCORE 16 PRINC'!K13,\")\")","v":"(0/0)"},":",null,"/",null,";",null,"/",null,";",null,"/",null,null,null,1,{"$f":"'SCORE 16 PRINC'!AH13","v":""},null,"(B2)","2B",null,null,"HEURE",null,null,null,"TERR",null,null,null,"ARB.",null,null,null,null,null,null,null,"9 -",{"$f":"'SCORE 16 PRINC'!S32","v":""}]
["B","T7",{"$f":"CONCATENATE('EMARG M Tableau PRIN'!C15,\" / \",'EMARG M Tableau PRIN'!G15)","v":"T / 7"},"2-4",{"$f":"CONCATENATE(C22,\" - \",C24)","v":"T / 7 - T / 15"},"(11)",null,null,null,null,{"$f":"CONCATENATE(\"(\",'SCORE 16 PRINC'!J17,\"/\",'SCORE 16 PRINC'!K17,\")\")","v":"(0/0)"},":",null,"/",null,";",null,"/",null,";",null,"/",null,null,null,2,{"$f":"'SCORE 16 PRINC'!AH14","v":""},null,null,{"$f":"AA22","v":""},null,null,null,null,null,null,null,null,null,null,null,null,null,null,null,null,null,null,"10 -",{"$f":"'SCORE 16 PRINC'!S33","v":""}]
[null,"T10",{"$f":"CONCATENATE('EMARG M Tableau PRIN'!C18,\" / \",'EMARG M Tableau PRIN'!G18)","v":"T / 10"},"1-3",{"$f":"CONCATENATE(C21,\" - \",C23)","v":"T / 2 - T / 10"},"(15)",null,null,null,null,{"$f":"CONCATENATE(\"(\",'SCORE 16 PRINC'!J21,\"/\",'SCORE 16 PRINC'!K21,\")\")","v":"(0/0)"},":",null,"/",null,";",null,"/",null,";",null,"/",null,null,null,3,{"$f":"'SCORE 16 PRINC'!AH15","v":""},null,null,null,null,null,null,null,null,null,null,null,null,null,null,null,null,null,null,null,null,null,"11 -",{"$f":"'SCORE 16 PRINC'!S34","v":""}]
[null,"T15",{"$f":"CONCATENATE('EMARG M Tableau PRIN'!C23,\" / \",'EMARG M Tableau PRIN'!G23)","v":"T / 15"},"3-4",{"$f":"CONCATENATE(C23,\" - \",C24)","v":"T / 10 - T / 15"},"(19)",null,null,null,null,{"$f":"CONCATENATE(\"(\",'SCORE 16 PRINC'!J25,\"/\",'SCORE 16 PRINC'!K25,\")\")","v":"(0/0)"},":",null,"/",null,";",null,"/",null,";",null,"/",null,null,null,4,{"$f":"'SCORE 16 PRINC'!AH16","v":""},null,null,null,null,null,null,null,null,null,null,null,null,null,null,null,null,null,null,null,null,null,"12 -",{"$f":"'SCORE 16 PRINC'!S35","v":""}]
[null,null,null,"1-2",{"$f":"CONCATENATE(C21,\" - \",C24)","v":"T / 2 - T / 15"},"(23)",null,null,null,null,{"$f":"CONCATENATE(\"(\",'SCORE 16 PRINC'!J29,\"/\",'SCORE 16 PRINC'!K29,\")\")","v":"(0/0)"},":",null,"/",null,";",null,"/",null,";",null,"/",null,null,null,null,null,null,null,{"$f":"AA37","v":""},"SCORE",null,"Set 1",null,null,null,"Set 2",null,null,null,"Set 3",null,null,null,null,null,null,null,"13 -",{"$f":"AA17","v":""}]
[null,null,null,null,null,null,null,null,null,null,null,null,null,null,null,null,null,null,null,null,null,null,null,null,null,null,null,null,null,"3D",{"$f":"CONCATENATE(\"(\",'SCORE 16 PRINC'!J34,\"/\",'SCORE 16 PRINC'!K34,\")\")","v":"(0/0)"},null,null,"/",null,null,null,"/",null,null,null,"/",null,null,null,null,null,null,"14 -",{"$f":"AA24","v":""}]
[null,null,null,"1-4",{"$f":"CONCATENATE(C28,\" - \",C31)","v":"T / 3 - T / 14"},"(2)",{"$f":"'PLANNING PS 16'!D17","v":"09:00:00"},null,null,null,{"$f":"CONCATENATE(\"(\",'SCORE 16 PRINC'!J10,\"/\",'SCORE 16 PRINC'!K10,\")\")","v":"(0/0)"},":",null,"/",null,";",null,"/",null,";",null,"/",null,null,null,null,null,null,"(B3)","2A",null,null,"HEURE",null,null,null,"TERR",null,null,null,"ARB.",null,null,null,null,null,null,null,"15 -",{"$f":"AA31","v":""}]
[null,"T3",{"$f":"CONCATENATE('EMARG M Tableau PRIN'!C11,\" / \",'EMARG M Tableau PRIN'!G11)","v":"T / 3"},"2-3",{"$f":"CONCATENATE(C29,\" - \",C30)","v":"T / 6 - T / 11"},"(6)",null,null,null,null,{"$f":"CONCATENATE(\"(\",'SCORE 16 PRINC'!J14,\"/\",'SCORE 16 PRINC'!K14,\")\")","v":"(0/0)"},":",null,"/",null,";",null,"/",null,";",null,"/",null,null,null,1,{"$f":"'SCORE 16 PRINC'!AH18","v":""},null,null,{"$f":"AA15","v":""},null,null,null,null,null,null,null,null,null,null,null,null,null,null,null,null,null,null,"16 -",{"$f":"AA38","v":""}]
["C","T6",{"$f":"CONCATENATE('EMARG M Tableau PRIN'!C14,\" / \",'EMARG M Tableau PRIN'!G14)","v":"T / 6"},"2-4",{"$f":"CONCATENATE(C29,\" - \",C31)","v":"T / 6 - T / 14"},"(10)",null,null,null,null,{"$f":"CONCATENATE(\"(\",'SCORE 16 PRINC'!J18,\"/\",'SCORE 16 PRINC'!K18,\")\")","v":"(0/0)"},":",null,"/",null,";",null,"/",null,";",null,"/",null,null,null,2,{"$f":"'SCORE 16 PRINC'!AH19","v":""}]
[null,"T11",{"$f":"CONCATENATE('EMARG M Tableau PRIN'!C19,\" / \",'EMARG M Tableau PRIN'!G19)","v":"T / 11"},"1-3",{"$f":"CONCATENATE(C28,\" - \",C30)","v":"T / 3 - T / 11"},"(14)",null,null,null,null,{"$f":"CONCATENATE(\"(\",'SCORE 16 PRINC'!J22,\"/\",'SCORE 16 PRINC'!K22,\")\")","v":"(0/0)"},":",null,"/",null,";",null,"/",null,";",null,"/",null,null,null,3,{"$f":"'SCORE 16 PRINC'!AH20","v":""}]
[null,"T14",{"$f":"CONCATENATE('EMARG M Tableau PRIN'!C22,\" / \",'EMARG M Tableau PRIN'!G22)","v":"T / 14"},"3-4",{"$f":"CONCATENATE(C30,\" - \",C31)","v":"T / 11 - T / 14"},"(18)",null,null,null,null,{"$f":"CONCATENATE(\"(\",'SCORE 16 PRINC'!J26,\"/\",'SCORE 16 PRINC'!K26,\")\")","v":"(0/0)"},":",null,"/",null,";",null,"/",null,";",null,"/",null,null,null,4,{"$f":"'SCORE 16 PRINC'!AH21","v":""},null,null,{"$f":"AA36","v":""},"SCORE",null,"Set 1",null,null,null,"Set 2",null,null,null,"Set 3"]
[null,null,null,"1-2",{"$f":"CONCATENATE(C28,\" - \",C29)","v":"T / 3 - T / 6"},"(22)",null,null,null,null,{"$f":"CONCATENATE(\"(\",'SCORE 16 PRINC'!J30,\"/\",'SCORE 16 PRINC'!K30,\")\")","v":"(0/0)"},":",null,"/",null,";",null,"/",null,";",null,"/",null,null,null,null,null,null,"(B4)","2D",{"$f":"CONCATENATE(\"(\",'SCORE 16 PRINC'!J35,\"/\",'SCORE 16 PRINC'!K35,\")\")","v":"(0/0)"},null,null,"/",null,null,null,"/",null,null,null,"/"]
[null,null,null,null,null,null,null,null,null,null,null,null,null,null,null,null,null,null,null,null,null,null,null,null,null,null,null,null,null,"3A",null,null,"HEURE",null,null,null,"TERR",null,null,null,"ARB."]
[null,null,null,"1-4",{"$f":"CONCATENATE(C35,\" - \",C38)","v":"T / 4 - T / 13"},"(4)",null,null,null,null,{"$f":"CONCATENATE(\"(\",'SCORE 16 PRINC'!J11,\"/\",'SCORE 16 PRINC'!K11,\")\")","v":"(0/0)"},":",null,"/",null,";",null,"/",null,";",null,"/",null,null,null,null,null,null,null,{"$f":"AA16","v":""}]
[null,"T4",{"$f":"CONCATENATE('EMARG M Tableau PRIN'!C12,\" / \",'EMARG M Tableau PRIN'!G12)","v":"T / 4"},"2-3",{"$f":"CONCATENATE(C36,\" - \",C37)","v":"T / 5 - T /12"},"(8)",null,null,null,null,{"$f":"CONCATENATE(\"(\",'SCORE 16 PRINC'!J15,\"/\",'SCORE 16 PRINC'!K15,\")\")","v":"(0/0)"},":",null,"/",null,";",null,"/",null,";",null,"/",null,null,null,1,{"$f":"'SCORE 16 PRINC'!AH23","v":""}]
["D","T5",{"$f":"CONCATENATE('EMARG M Tableau PRIN'!C13,\" / \",'EMARG M Tableau PRIN'!G13)","v":"T / 5"},"2-4",{"$f":"CONCATENATE(C36,\" - \",C38)","v":"T / 5 - T / 13"},"(12)",null,null,null,null,{"$f":"CONCATENATE(\"(\",'SCORE 16 PRINC'!J19,\"/\",'SCORE 16 PRINC'!K19,\")\")","v":"(0/0)"},":",null,"/",null,";",null,"/",null,";",null,"/",null,null,null,2,{"$f":"'SCORE 16 PRINC'!AH24","v":""}]
[null,"T12",{"$f":"CONCATENATE('EMARG M Tableau PRIN'!C20,\" /\",'EMARG M Tableau PRIN'!G20)","v":"T /12"},"1-3",{"$f":"CONCATENATE(C35,\" - \",C37)","v":"T / 4 - T /12"},"(16)",null,null,null,null,{"$f":"CONCATENATE(\"(\",'SCORE 16 PRINC'!J23,\"/\",'SCORE 16 PRINC'!K23,\")\")","v":"(0/0)"},":",null,"/",null,";",null,"/",null,";",null,"/",null,null,null,3,{"$f":"'SCORE 16 PRINC'!AH25","v":""}]
[null,"T13",{"$f":"CONCATENATE('EMARG M Tableau PRIN'!C21,\" / \",'EMARG M Tableau PRIN'!G21)","v":"T / 13"},"3-4",{"$f":"CONCATENATE(C37,\" - \",C38)","v":"T /12 - T / 13"},"(20)",null,null,null,null,{"$f":"CONCATENATE(\"(\",'SCORE 16 PRINC'!J27,\"/\",'SCORE 16 PRINC'!K27,\")\")","v":"(0/0)"},":",null,"/",null,";",null,"/",null,";",null,"/",null,null,null,4,{"$f":"'SCORE 16 PRINC'!AH26","v":""}]
[null,null,null,"1-2",{"$f":"CONCATENATE(C35,\" - \",C36)","v":"T / 4 - T / 5"},"(24)",null,null,null,null,{"$f":"CONCATENATE(\"(\",'SCORE 16 PRINC'!J31,\"/\",'SCORE 16 PRINC'!K31,\")\")","v":"(0/0)"},":",null,"/",null,";",null,"/",null,";",null,"/"]
[]
[]
[null,null,null,null,null,null,null,"1/4 FINALE",null,null,null,null,null,null,null,null,null,null,null,null,null,null,null,null,null,null,null,null,null,"1/2 FINALE",null,null,null,null,null,null,null,null,null,null,null,null,null,null,null,null,"FINALE"]
[]
[null,null,null,null,null,null,null,{"$f":"AA14","v":""},null,null,"SCORE",null,"Set 1",null,null,null,"Set 2",null,null,null,"Set 3",null,null,null,null,null,null,null,null,{"$f":"'SCORE 16 PRINC'!R36","v":""},null,null,"SCORE",null,"Set 1",null,null,null,"Set 2",null,null,null,"Set 3"]
[null,null,null,null,null,"1/4",null,"1A",null,null,{"$f":"CONCATENATE(\"(\",'SCORE 16 PRINC'!J36,\"/\",'SCORE 16 PRINC'!K36,\")\")","v":"(0/0)"},null,null,"/",null,null,null,"/",null,null,null,"/",null,null,null,null,null,null,null,null,null,null,{"$f":"CONCATENATE(\"(\",'SCORE 16 PRINC'!J40,\"/\",'SCORE 16 PRINC'!K40,\")\")","v":"(0/0)"},null,null,"/",null,null,null,"/",null,null,null,"/"]
[null,null,null,null,null,"(25)",null,null,null,null,null,null,"HEURE",null,null,null,"TERR",null,null,null,"ARB.",null,null,null,null,null,null,null,null,null,null,null,null,null,"HEURE",null,null,null,"TERR",null,null,null,"ARB."]
[null,null,null,null,null,null,null,{"$f":"'SCORE 16 PRINC'!R32","v":""},null,null,null,null,null,null,null,null,null,null,null,null,null,null,null,null,null,null,null,null,null,{"$f":"'SCORE 16 PRINC'!R37","v":""},null,null,null,null,null,null,null,null,null,null,null,null,null,null,null,null,{"$f":"'SCORE 16 PRINC'!R40","v":""},null,null,null,"SCORE",null,"Set 1",null,null,null,"Set 2",null,null,null,"Set 3"]
[null,null,null,null,null,null,null,null,null,null,null,null,null,null,null,null,null,null,null,null,null,null,null,null,null,null,null,null,null,null,null,null,null,null,null,null,null,null,null,null,null,null,null,null,null,null,null,null,null,null,{"$f":"CONCATENATE(\"(\",'SCORE 16 PRINC'!J43,\"/\",'SCORE 16 PRINC'!K43,\")\")","v":"(0/0)"},null,null,"/",null,null,null,"/",null,null,null,"/"]
[null,null,null,null,null,null,null,null,null,null,null,null,null,null,null,null,null,null,null,null,null,null,null,null,null,null,null,null,null,null,null,null,null,null,null,null,null,null,null,null,null,null,null,null,null,null,null,null,null,null,null,null,"HEURE",null,null,null,"TERR",null,null,null,"ARB."]
[null,null,null,null,null,null,null,{"$f":"'SCORE 16 PRINC'!R33","v":""},null,null,"SCORE",null,"Set 1",null,null,null,"Set 2",null,null,null,"Set 3",null,null,null,null,null,null,null,null,{"$f":"'SCORE 16 PRINC'!R39","v":""},null,null,"SCORE",null,"Set 1",null,null,null,"Set 2",null,null,null,"Set 3",null,null,null,{"$f":"'SCORE 16 PRINC'!R41","v":""}]
[null,null,null,null,null,"1/4",null,null,null,null,{"$f":"CONCATENATE(\"(\",'SCORE 16 PRINC'!J37,\"/\",'SCORE 16 PRINC'!K37,\")\")","v":"(0/0)"},null,null,"/",null,null,null,"/",null,null,null,"/",null,null,null,null,null,null,null,null,null,null,{"$f":"CONCATENATE(\"(\",'SCORE 16 PRINC'!J41,\"/\",'SCORE 16 PRINC'!K41,\")\")","v":"(0/0)"},null,null,"/",null,null,null,"/",null,null,null,"/"]
[null,null,null,null,null,"(26)",null,"1D",null,null,null,null,"HEURE",null,null,null,"TERR",null,null,null,"ARB.",null,null,null,null,null,null,null,null,null,null,null,null,null,"HEURE",null,null,null,"TERR",null,null,null,"ARB."]
[null,null,null,null,null,null,null,{"$f":"AA35","v":""},null,null,null,null,null,null,null,null,null,null,null,null,null,null,null,null,null,null,null,null,null,{"$f":"'SCORE 16 PRINC'!R38","v":""}]
[]
[]
[null,null,null,null,null,null,null,{"$f":"AA28","v":""},null,null,"SCORE",null,"Set 1",null,null,null,"Set 2",null,null,null,"Set 3",null,null,null,null,null,null,null,null,"PLACE 3/4"]
[null,null,null,null,null,"1/4",null,"1C",null,null,{"$f":"CONCATENATE(\"(\",'SCORE 16 PRINC'!J38,\"/\",'SCORE 16 PRINC'!K38,\")\")","v":"(0/0)"},null,null,"/",null,null,null,"/",null,null,null,"/"]
[null,null,null,null,null,"(27)",null,null,null,null,null,null,"HEURE",null,null,null,"TERR",null,null,null,"ARB.",null,null,null,null,null,null,null,null,{"$f":"'SCORE 16 PRINC'!S40","v":""},null,null,"SCORE",null,"Set 1",null,null,null,"Set 2",null,null,null,"Set 3"]
[null,null,null,null,null,null,null,{"$f":"'SCORE 16 PRINC'!R34","v":""},null,null,null,null,null,null,null,null,null,null,null,null,null,null,null,null,null,null,null,null,null,null,null,null,{"$f":"CONCATENATE(\"(\",'SCORE 16 PRINC'!J42,\"/\",'SCORE 16 PRINC'!K42,\")\")","v":"(0/0)"},null,null,"/",null,null,null,"/",null,null,null,"/"]
[null,null,null,null,null,null,null,null,null,null,null,null,null,null,null,null,null,null,null,null,null,null,null,null,null,null,null,null,null,null,null,null,null,null,"HEURE",null,null,null,"TERR",null,null,null,"ARB."]
[null,null,null,null,null,null,null,null,null,null,null,null,null,null,null,null,null,null,null,null,null,null,null,null,null,null,null,null,null,{"$f":"'SCORE 16 PRINC'!S41","v":""}]
[null,null,null,null,null,"1/4",null,{"$f":"'SCORE 16 PRINC'!R35","v":""},null,null,"SCORE",null,"Set 1",null,null,null,"Set 2",null,null,null,"Set 3"]
[null,null,null,null,null,"(28)",null,null,null,null,{"$f":"CONCATENATE(\"(\",'SCORE 16 PRINC'!J39,\"/\",'SCORE 16 PRINC'!K39,\")\")","v":"(0/0)"},null,null,"/",null,null,null,"/",null,null,null,"/"]
[null,null,null,null,null,null,null,"1B",null,null,null,null,"HEURE",null,null,null,"TERR",null,null,null,"ARB."]
[null,null,null,null,null,null,null,{"$f":"AA21","v":""}]

{"sheet":"RELEVE","index":9,"n_rows":93,"n_cols":14,"rows_kept":93,"cut":false,"hidden":false,"merged":[[92,2,98,10],[14,4,14,6],[15,2,15,3],[15,4,15,6],[16,2,16,3],[16,4,16,6],[17,2,17,3],[17,4,17,6],[18,2,18,3],[18,4,18,6],[19,2,19,3],[19,4,19,6],[83,2,89,10],[9,8,9,9],[2,2,2,3],[2,4,2,10],[3,2,3,3],[3,4,3,5],[4,2,4,3],[4,4,4,5],[5,2,5,3],[5,4,5,5],[6,2,6,3],[6,4,6,5],[8,8,8,9]]}
[null,null,"RELEVE DES RESULTATS ET SANCTIONS - TOURNOI DE BEACH VOLLEY"]
[]
[null,null,"APPELATION DU TOURNOI",null,{"$f":"IF('LISTE ENGAGES'!Q3=\"\",\"\",'LISTE ENGAGES'!Q3)","v":""}]
[null,null,"TYPE",null,{"$f":"IF('LISTE ENGAGES'!Q5=\"\",\"\",'LISTE ENGAGES'!Q5)","v":""}]
[null,null,"GENRE",null,{"$f":"IF('LISTE ENGAGES'!Q9=\"\",\"\",'LISTE ENGAGES'!Q9)","v":""}]
[null,null,"DATE",null,{"$f":"IF('LISTE ENGAGES'!Q7=\"\",\"\",CONCATENATE('LISTE ENGAGES'!Q7,\"-\",'LISTE ENGAGES'!Q8,\"/\",'LISTE ENGAGES'!Q6))","v":""}]
[null,null,"ORGANISATEUR",null,{"$f":"IF('LISTE ENGAGES'!Q12=\"\",\"\",'LISTE ENGAGES'!Q12)","v":""}]
[]
[null,null,"NOMBRE EQUIPE TABLEAU :",null,null,"PRINCIPAL",null,null,"QUALIFICATION"]
[null,null,"NOMBRE EQUIPE PRESENTES PAR TABLEAU",null,null,"PRINCIPAL",null,null,"QUALIFICATION"]
[]
[]
[null,null,"COMPOSITION DE LA COMMISSION DE DIRECTION"]
[]
[null,null,"DELEGUE INSTANCE FEDERAL"]
[null,null,"SUPERVISEUR"]
[null,null,"JUGE ARBITRE"]
[null,null,"ORGANISATEUR"]
[null,null,"REPRESENTANT JOUEURS"]
[null,null,"RAPPORTEUR*"]
[]
[]
[]
[]
[]
[null,null,"EQUIPES ABSENTES"]
[null,null,"NOM","PRENOM","LIC J1","club J1","NOM2","PRENOM3","LIC J2","club J2"]
[]
[]
[]
[]
[]
[]
[null,null,"RECLAMATIONS"]
[null,null,"NOM","PRENOM","LIC J1","club J1","NOM2","PRENOM3","LIC J2","club J2","RANG","NIVEAU","MOTIF ","AVIS COMMISSION"]
[null,1]
[null,2]
[null,3]
[null,4]
[null,5]
[null,6]
[]
[null,null,"EQUIPES/JOUEURS SANCTIONNES"]
[null,null,"NOM","PRENOM","LIC J1","club J1","NOM2","PRENOM3","LIC J2","club J2","RANG","SANCTION","MOTIF ","AVIS COMMISSION"]
[null,1]
[null,2]
[null,3]
[null,4]
[null,5]
[null,6]
[]
[null,null,"CLASSEMENT FINAL"]
[null,null,"NOM","PRENOM","LIC J1","club J1","NOM2","PRENOM3","LIC J2","club J2","RANG"]
[null,null,{"$f":"'LISTE ENGAGES'!C10","v":0},{"$f":"'LISTE ENGAGES'!D10","v":0},{"$f":"'LISTE ENGAGES'!E10","v":0},{"$f":"'LISTE ENGAGES'!F10","v":0},{"$f":"'LISTE ENGAGES'!G10","v":0},{"$f":"'LISTE ENGAGES'!H10","v":0},{"$f":"'LISTE ENGAGES'!I10","v":0},{"$f":"'LISTE ENGAGES'!J10","v":0},1]
[null,null,{"$f":"'LISTE ENGAGES'!C9","v":0},{"$f":"'LISTE ENGAGES'!D9","v":0},{"$f":"'LISTE ENGAGES'!E9","v":0},{"$f":"'LISTE ENGAGES'!F9","v":0},{"$f":"'LISTE ENGAGES'!G9","v":0},{"$f":"'LISTE ENGAGES'!H9","v":0},{"$f":"'LISTE ENGAGES'!I9","v":0},{"$f":"'LISTE ENGAGES'!J9","v":0},2]
[null,null,{"$f":"'LISTE ENGAGES'!C11","v":0},{"$f":"'LISTE ENGAGES'!D11","v":0},{"$f":"'LISTE ENGAGES'!E11","v":0},{"$f":"'LISTE ENGAGES'!F11","v":0},{"$f":"'LISTE ENGAGES'!G11","v":0},{"$f":"'LISTE ENGAGES'!H11","v":0},{"$f":"'LISTE ENGAGES'!I11","v":0},{"$f":"'LISTE ENGAGES'!J11","v":0}]
[null,null,{"$f":"'LISTE ENGAGES'!C12","v":0},{"$f":"'LISTE ENGAGES'!D12","v":0},{"$f":"'LISTE ENGAGES'!E12","v":0},{"$f":"'LISTE ENGAGES'!F12","v":0},{"$f":"'LISTE ENGAGES'!G12","v":0},{"$f":"'LISTE ENGAGES'!H12","v":0},{"$f":"'LISTE ENGAGES'!I12","v":0},{"$f":"'LISTE ENGAGES'!J12","v":0}]
[null,null,{"$f":"'LISTE ENGAGES'!C13","v":0},{"$f":"'LISTE ENGAGES'!D13","v":0},{"$f":"'LISTE ENGAGES'!E13","v":0},{"$f":"'LISTE ENGAGES'!F13","v":0},{"$f":"'LISTE ENGAGES'!G13","v":0},{"$f":"'LISTE ENGAGES'!H13","v":0},{"$f":"'LISTE ENGAGES'!I13","v":0},{"$f":"'LISTE ENGAGES'!J13","v":0}]
[null,null,{"$f":"'LISTE ENGAGES'!C14","v":0},{"$f":"'LISTE ENGAGES'!D14","v":0},{"$f":"'LISTE ENGAGES'!E14","v":0},{"$f":"'LISTE ENGAGES'!F14","v":0},{"$f":"'LISTE ENGAGES'!G14","v":0},{"$f":"'LISTE ENGAGES'!H14","v":0},{"$f":"'LISTE ENGAGES'!I14","v":0},{"$f":"'LISTE ENGAGES'!J14","v":0}]
[null,null,{"$f":"'LISTE ENGAGES'!C15","v":0},{"$f":"'LISTE ENGAGES'!D15","v":0},{"$f":"'LISTE ENGAGES'!E15","v":0},{"$f":"'LISTE ENGAGES'!F15","v":0},{"$f":"'LISTE ENGAGES'!G15","v":0},{"$f":"'LISTE ENGAGES'!H15","v":0},{"$f":"'LISTE ENGAGES'!I15","v":0},{"$f":"'LISTE ENGAGES'!J15","v":0}]
[null,null,{"$f":"'LISTE ENGAGES'!C16","v":0},{"$f":"'LISTE ENGAGES'!D16","v":0},{"$f":"'LISTE ENGAGES'!E16","v":0},{"$f":"'LISTE ENGAGES'!F16","v":0},{"$f":"'LISTE ENGAGES'!G16","v":0},{"$f":"'LISTE ENGAGES'!H16","v":0},{"$f":"'LISTE ENGAGES'!I16","v":0},{"$f":"'LISTE ENGAGES'!J16","v":0}]
[null,null,{"$f":"'LISTE ENGAGES'!C17","v":0},{"$f":"'LISTE ENGAGES'!D17","v":0},{"$f":"'LISTE ENGAGES'!E17","v":0},{"$f":"'LISTE ENGAGES'!F17","v":0},{"$f":"'LISTE ENGAGES'!G17","v":0},{"$f":"'LISTE ENGAGES'!H17","v":0},{"$f":"'LISTE ENGAGES'!I17","v":0},{"$f":"'LISTE ENGAGES'!J17","v":0}]
[null,null,{"$f":"'LISTE ENGAGES'!C18","v":0},{"$f":"'LISTE ENGAGES'!D18","v":0},{"$f":"'LISTE ENGAGES'!E18","v":0},{"$f":"'LISTE ENGAGES'!F18","v":0},{"$f":"'LISTE ENGAGES'!G18","v":0},{"$f":"'LISTE ENGAGES'!H18","v":0},{"$f":"'LISTE ENGAGES'!I18","v":0},{"$f":"'LISTE ENGAGES'!J18","v":0}]
[null,null,{"$f":"'LISTE ENGAGES'!C19","v":0},{"$f":"'LISTE ENGAGES'!D19","v":0},{"$f":"'LISTE ENGAGES'!E19","v":0},{"$f":"'LISTE ENGAGES'!F19","v":0},{"$f":"'LISTE ENGAGES'!G19","v":0},{"$f":"'LISTE ENGAGES'!H19","v":0},{"$f":"'LISTE ENGAGES'!I19","v":0},{"$f":"'LISTE ENGAGES'!J19","v":0}]
[null,null,{"$f":"'LISTE ENGAGES'!C20","v":0},{"$f":"'LISTE ENGAGES'!D20","v":0},{"$f":"'LISTE ENGAGES'!E20","v":0},{"$f":"'LISTE ENGAGES'!F20","v":0},{"$f":"'LISTE ENGAGES'!G20","v":0},{"$f":"'LISTE ENGAGES'!H20","v":0},{"$f":"'LISTE ENGAGES'!I20","v":0},{"$f":"'LISTE ENGAGES'!J20","v":0}]
[null,null,{"$f":"'LISTE ENGAGES'!C21","v":0},{"$f":"'LISTE ENGAGES'!D21","v":0},{"$f":"'LISTE ENGAGES'!E21","v":0},{"$f":"'LISTE ENGAGES'!F21","v":0},{"$f":"'LISTE ENGAGES'!G21","v":0},{"$f":"'LISTE ENGAGES'!H21","v":0},{"$f":"'LISTE ENGAGES'!I21","v":0},{"$f":"'LISTE ENGAGES'!J21","v":0}]
[null,null,{"$f":"'LISTE ENGAGES'!C22","v":0},{"$f":"'LISTE ENGAGES'!D22","v":0},{"$f":"'LISTE ENGAGES'!E22","v":0},{"$f":"'LISTE ENGAGES'!F22","v":0},{"$f":"'LISTE ENGAGES'!G22","v":0},{"$f":"'LISTE ENGAGES'!H22","v":0},{"$f":"'LISTE ENGAGES'!I22","v":0},{"$f":"'LISTE ENGAGES'!J22","v":0}]
[null,null,{"$f":"'LISTE ENGAGES'!C23","v":0},{"$f":"'LISTE ENGAGES'!D23","v":0},{"$f":"'LISTE ENGAGES'!E23","v":0},{"$f":"'LISTE ENGAGES'!F23","v":0},{"$f":"'LISTE ENGAGES'!G23","v":0},{"$f":"'LISTE ENGAGES'!H23","v":0},{"$f":"'LISTE ENGAGES'!I23","v":0},{"$f":"'LISTE ENGAGES'!J23","v":0}]
[null,null,{"$f":"'LISTE ENGAGES'!C24","v":0},{"$f":"'LISTE ENGAGES'!D24","v":0},{"$f":"'LISTE ENGAGES'!E24","v":0},{"$f":"'LISTE ENGAGES'!F24","v":0},{"$f":"'LISTE ENGAGES'!G24","v":0},{"$f":"'LISTE ENGAGES'!H24","v":0},{"$f":"'LISTE ENGAGES'!I24","v":0},{"$f":"'LISTE ENGAGES'!J24","v":0}]
[null,null,{"$f":"'LISTE ENGAGES'!C25","v":0},{"$f":"'LISTE ENGAGES'!D25","v":0},{"$f":"'LISTE ENGAGES'!E25","v":0},{"$f":"'LISTE ENGAGES'!F25","v":0},{"$f":"'LISTE ENGAGES'!G25","v":0},{"$f":"'LISTE ENGAGES'!H25","v":0},{"$f":"'LISTE ENGAGES'!I25","v":0},{"$f":"'LISTE ENGAGES'!J25","v":0}]
[null,null,{"$f":"'LISTE ENGAGES'!C26","v":0},{"$f":"'LISTE ENGAGES'!D26","v":0},{"$f":"'LISTE ENGAGES'!E26","v":0},{"$f":"'LISTE ENGAGES'!F26","v":0},{"$f":"'LISTE ENGAGES'!G26","v":0},{"$f":"'LISTE ENGAGES'!H26","v":0},{"$f":"'LISTE ENGAGES'!I26","v":0},{"$f":"'LISTE ENGAGES'!J26","v":0}]
[null,null,{"$f":"'LISTE ENGAGES'!C27","v":0},{"$f":"'LISTE ENGAGES'!D27","v":0},{"$f":"'LISTE ENGAGES'!E27","v":0},{"$f":"'LISTE ENGAGES'!F27","v":0},{"$f":"'LISTE ENGAGES'!G27","v":0},{"$f":"'LISTE ENGAGES'!H27","v":0},{"$f":"'LISTE ENGAGES'!I27","v":0},{"$f":"'LISTE ENGAGES'!J27","v":0}]
[null,null,{"$f":"'LISTE ENGAGES'!C28","v":0},{"$f":"'LISTE ENGAGES'!D28","v":0},{"$f":"'LISTE ENGAGES'!E28","v":0},{"$f":"'LISTE ENGAGES'!F28","v":0},{"$f":"'LISTE ENGAGES'!G28","v":0},{"$f":"'LISTE ENGAGES'!H28","v":0},{"$f":"'LISTE ENGAGES'!I28","v":0},{"$f":"'LISTE ENGAGES'!J28","v":0}]
[null,null,{"$f":"'LISTE ENGAGES'!C29","v":0},{"$f":"'LISTE ENGAGES'!D29","v":0},{"$f":"'LISTE ENGAGES'!E29","v":0},{"$f":"'LISTE ENGAGES'!F29","v":0},{"$f":"'LISTE ENGAGES'!G29","v":0},{"$f":"'LISTE ENGAGES'!H29","v":0},{"$f":"'LISTE ENGAGES'!I29","v":0},{"$f":"'LISTE ENGAGES'!J29","v":0}]
[null,null,{"$f":"'LISTE ENGAGES'!C30","v":0},{"$f":"'LISTE ENGAGES'!D30","v":0},{"$f":"'LISTE ENGAGES'!E30","v":0},{"$f":"'LISTE ENGAGES'!F30","v":0},{"$f":"'LISTE ENGAGES'!G30","v":0},{"$f":"'LISTE ENGAGES'!H30","v":0},{"$f":"'LISTE ENGAGES'!I30","v":0},{"$f":"'LISTE ENGAGES'!J30","v":0}]
[null,null,{"$f":"'LISTE ENGAGES'!C31","v":0},{"$f":"'LISTE ENGAGES'!D31","v":0},{"$f":"'LISTE ENGAGES'!E31","v":0},{"$f":"'LISTE ENGAGES'!F31","v":0},{"$f":"'LISTE ENGAGES'!G31","v":0},{"$f":"'LISTE ENGAGES'!H31","v":0},{"$f":"'LISTE ENGAGES'!I31","v":0},{"$f":"'LISTE ENGAGES'!J31","v":0}]
[null,null,{"$f":"'LISTE ENGAGES'!C32","v":0},{"$f":"'LISTE ENGAGES'!D32","v":0},{"$f":"'LISTE ENGAGES'!E32","v":0},{"$f":"'LISTE ENGAGES'!F32","v":0},{"$f":"'LISTE ENGAGES'!G32","v":0},{"$f":"'LISTE ENGAGES'!H32","v":0},{"$f":"'LISTE ENGAGES'!I32","v":0},{"$f":"'LISTE ENGAGES'!J32","v":0}]
[null,null,{"$f":"'LISTE ENGAGES'!C33","v":0},{"$f":"'LISTE ENGAGES'!D33","v":0},{"$f":"'LISTE ENGAGES'!E33","v":0},{"$f":"'LISTE ENGAGES'!F33","v":0},{"$f":"'LISTE ENGAGES'!G33","v":0},{"$f":"'LISTE ENGAGES'!H33","v":0},{"$f":"'LISTE ENGAGES'!I33","v":0},{"$f":"'LISTE ENGAGES'!J33","v":0}]
[null,null,{"$f":"'LISTE ENGAGES'!C34","v":0},{"$f":"'LISTE ENGAGES'!D34","v":0},{"$f":"'LISTE ENGAGES'!E34","v":0},{"$f":"'LISTE ENGAGES'!F34","v":0},{"$f":"'LISTE ENGAGES'!G34","v":0},{"$f":"'LISTE ENGAGES'!H34","v":0},{"$f":"'LISTE ENGAGES'!I34","v":0},{"$f":"'LISTE ENGAGES'!J34","v":0}]
[null,null,{"$f":"'LISTE ENGAGES'!C35","v":0},{"$f":"'LISTE ENGAGES'!D35","v":0},{"$f":"'LISTE ENGAGES'!E35","v":0},{"$f":"'LISTE ENGAGES'!F35","v":0},{"$f":"'LISTE ENGAGES'!G35","v":0},{"$f":"'LISTE ENGAGES'!H35","v":0},{"$f":"'LISTE ENGAGES'!I35","v":0},{"$f":"'LISTE ENGAGES'!J35","v":0}]
[null,null,{"$f":"'LISTE ENGAGES'!C36","v":0},{"$f":"'LISTE ENGAGES'!D36","v":0},{"$f":"'LISTE ENGAGES'!E36","v":0},{"$f":"'LISTE ENGAGES'!F36","v":0},{"$f":"'LISTE ENGAGES'!G36","v":0},{"$f":"'LISTE ENGAGES'!H36","v":0},{"$f":"'LISTE ENGAGES'!I36","v":0},{"$f":"'LISTE ENGAGES'!J36","v":0}]
[]
[]
[null,null,"REMARQUES :"]
[]
[]
[]
[]
[]
[]
[]
[]
[null,null,"SIGNATURES :"]