{"text_format":"1","workbook":"xlsx","n_sheets":6,"sheets":["LISTE ENGAGES","EMARGEMENT","TAB BRE 16","PLANNING","SCORE","RELEVE"],"not_rendered":{"charts":0,"images":3,"macros":1,"external_links":0,"defined_names":6,"comments":0,"pivot_tables":0},"unopened":[],"bounds":{"document_bytes":16777216,"sheet_cells":100000,"rows_first":2000,"rows_last":500,"rows_between":2000,"halvings":0,"cell_chars":16384,"cell_head_chars":4096},"cells_cut":0,"cells_raw":0,"read":"whole","date_system":"1900"}

{"sheet":"LISTE ENGAGES","index":0,"n_rows":34,"n_cols":36,"rows_kept":34,"cut":false,"hidden":false,"merged":[[12,13,12,17],[3,2,3,4],[3,5,3,6],[0,2,2,6],[0,7,2,7],[4,2,4,7],[5,2,5,7],[11,13,11,17]]}
[null,null,{"$f":"IF(Q3=\"\",P3,Q3)","v":"APPELATION TOURNOI"},null,null,null,null,{"$f":"IF(Q10=\"\",P10,Q10)","v":"ORGANISATEUR"}]
[null,null,null,null,null,null,null,null,null,null,null,null,null,null,null,null,"IDENTITE DU TOURNOI"]
[null,null,null,null,null,null,null,null,null,null,null,null,null,null,null,"APPELATION TOURNOI"]
[null,null,{"$f":"IF($Q$4=\"\",$P$4,$Q$4)","v":"LIEU"},null,null,{"$f":"IF(Q7=\"\",\"DATE\",CONCATENATE(Q7,\"-\",Q8,\"/\",Q6))","v":"DATE"},null,{"$f":"IF(Q9=\"\",P9,Q9)","v":"GENRE"},null,null,null,null,null,null,null,"LIEU"]
[null,null,{"$f":"IF(Q5=\"\",P5,Q5)","v":"TYPE"},null,null,null,null,null,null,null,null,null,null,null,null,"TYPE"]
[null,null,"LISTE EQUIPES ENGAGEES",null,null,null,null,null,null,null,null,null,null,null,null,"ANNEE",null,null,null,null,null,null,null,null,null,null,null,null,null,"CHAMPIONNAT DE France",null,2020,null,"MASCULIN",null,"ABS"]
[null,null,null,null,null,null,null,null,null,null,null,null,null,null,null,"DATE DEBUT",null,null,null,null,null,null,null,null,null,null,null,null,null,"SERIE 1 - 2500",null,2021,null,"FEMININ",null,1]
["N°",null,"NOM","PRENOM","LICENCE","CLUB","NOM","PRENOM","LICENCE","CLUB","pts","tir",null,null,null,"DATE FIN",null,null,null,null,null,null,null,null,null,null,null,null,null,"SERIE 1 - 2000",null,2022,null,"MIXTE",null,2]
[1,null,null,null,null,null,null,null,null,null,null,null,null,null,null,"GENRE",null,null,null,null,null,null,null,null,null,null,null,null,null,"SERIE 1 - 1500",null,2023,null,null,null,3]
[2,null,null,null,null,null,null,null,null,null,null,null,null,null,null,"ORGANISATEUR",null,null,null,null,null,null,null,null,null,null,null,null,null,"SERIE 2 - 1000",null,2024,null,null,null,4]
[3,null,null,null,null,null,null,null,null,null,null,null,null,null,null,null,null,null,null,null,null,null,null,null,null,null,null,null,null,"SERIE 2 - 750",null,null,null,null,null,5]
[4,null,null,null,null,null,null,null,null,null,null,null,null,"1- Commencez par renseigner le tableau ci-dessus \"identité du tournoi\"",null,null,null,null,null,null,null,null,null,null,null,null,null,null,null,"SERIE 2 - 500",null,null,null,null,null,7]
[5,null,null,null,null,null,null,null,null,null,null,null,null,"2- Copiez-collez la liste des équipes engagées dans les champs ci-contre en respectant : ",null,null,null,null,null,null,null,null,null,null,null,null,null,null,null,"SERIE 2 - 250",null,null,null,null,null,9]
[6,null,null,null,null,null,null,null,null,null,null,null,null,"- nom et premon séparés pour chaque joueur ( à défaut, ne mentionez que le nom)",null,null,null,null,null,null,null,null,null,null,null,null,null,null,null,"SERIE 3 - 150",null,null,null,null,null,13]
[7,null,null,null,null,null,null,null,null,null,null,null,null,"- l'ordre décroissant des têtes de séries",null,null,null,null,null,null,null,null,null,null,null,null,null,null,null,"SERIE 3 - 100"]
[8,null,null,null,null,null,null,null,null,null,null,null,null,"3- Renseignez l'onglet \"EMARG….\" selon l'avancée dans les tableaux"]
[9,null,null,null,null,null,null,null,null,null,null,null,null,"4-Renseignez les scores des rencontres dans l'onglet \" SCORE…\" en fonction de l'avancée du tableau"]
[10,null,null,null,null,null,null,null,null,null,null,null,null,"Les onglets \"TAB…\" s'actualisent automatiquement, il n'y a rien à saisir."]
[11,null,null,null,null,null,null,null,null,null,null,null,null,"5- Renseignez l'onglet \"RELEVE\" à l'issue de la compétition"]
[12]
[13]
[14]
[15]
[16]
[17]
[18]
[19]
[20]
[21]
[22]
[23]
[24]
[25]
[26]

{"sheet":"EMARGEMENT","index":1,"n_rows":24,"n_cols":8,"rows_kept":24,"cut":false,"hidden":false,"merged":[[0,2,2,4],[0,5,2,5],[3,2,3,3],[4,2,4,5],[5,2,5,5]]}
[null,null,{"$f":"IF('LISTE ENGAGES'!Q3=\"\",'LISTE ENGAGES'!P3,'LISTE ENGAGES'!Q3)","v":"APPELATION TOURNOI"},null,null,{"$f":"IF('LISTE ENGAGES'!Q10=\"\",'LISTE ENGAGES'!P10,'LISTE ENGAGES'!Q10)","v":"ORGANISATEUR"}]
[]
[]
[null,null,{"$f":"IF('LISTE ENGAGES'!Q4=\"\",'LISTE ENGAGES'!P4,'LISTE ENGAGES'!Q4)","v":"LIEU"},null,{"$f":"IF('LISTE ENGAGES'!Q6=\"\",\"DATE\",CONCATENATE('LISTE ENGAGES'!Q7,\"-\",'LISTE ENGAGES'!Q8,\"/\",'LISTE ENGAGES'!Q9))","v":"DATE"},{"$f":"IF('LISTE ENGAGES'!Q9=\"\",'LISTE ENGAGES'!P9,'LISTE ENGAGES'!Q9)","v":"GENRE"}]
[null,null,{"$f":"IF('LISTE ENGAGES'!Q5=\"\",'LISTE ENGAGES'!P5,'LISTE ENGAGES'!Q5)","v":"TYPE"}]
[null,null,"EMARGEMENT"]
[]
["N°",null,"NOM","PRENOM","NOM","PRENOM","pts","tir"]
[1]
[2]
[3]
[4]
[5]
[6]
[7]
[8]
[9]
[10]
[11]
[12]
[13]
[14]
[15]
[16]

{"sheet":"TAB BRE 16","index":2,"n_rows":94,"n_cols":20,"rows_kept":94,"cut":false,"hidden":false,"merged":[[6,7,6,14],[0,7,2,13],[4,7,4,13],[3,7,3,9],[3,10,3,11],[3,12,3,13],[5,7,5,14],[0,14,4,14]]}
[null,null,null,null,null,null,null,{"$f":"IF('LISTE ENGAGES'!Q3=\"\",'LISTE ENGAGES'!P3,'LISTE ENGAGES'!Q3)","v":"APPELATION TOURNOI"},null,null,null,null,null,null,{"$f":"IF('LISTE ENGAGES'!Q10=\"\",'LISTE ENGAGES'!P10,'LISTE ENGAGES'!Q10)","v":"ORGANISATEUR"}]
[]
[]
[null,null,null,null,null,null,null,{"$f":"IF('LISTE ENGAGES'!Q4=\"\",'LISTE ENGAGES'!P4,'LISTE ENGAGES'!Q4)","v":"LIEU"},null,null,{"$f":"IF('LISTE ENGAGES'!Q6=\"\",\"DATE\",CONCATENATE('LISTE ENGAGES'!Q7,\"-\",'LISTE ENGAGES'!Q8,\"/\",'LISTE ENGAGES'!Q9))","v":"DATE"},null,{"$f":"IF('LISTE ENGAGES'!Q9=\"\",'LISTE ENGAGES'!P9,'LISTE ENGAGES'!Q9)","v":"GENRE"}]
[null,null,null,null,null,null,null,{"$f":"IF('LISTE ENGAGES'!Q5=\"\",'LISTE ENGAGES'!P5,'LISTE ENGAGES'!Q5)","v":"TYPE"}]
[]
[null,null,null,null,null,null,null,"TABLEAU PRINCIPAL"]
[]
[]
[]
[]
[null,null,"POULES",null,null,null,null,"RESULTATS",null,null,null,"CLASSEMENT",null,null,"1/4 FINALES",null,"1/2 FINALES",null,"FINALES"]
[]
[]
[]
[null,null,null,null,null,{"$f":"IF(C21=\" / \",\"TS1\",C21)","v":"TS1"}]
[null,null,null,null,null,null,null,{"$f":"IF(SCORE!J8=\"\",\"\",SCORE!J8)","v":""}]
[null,null,null,null,null,"A1",null,{"$f":"CONCATENATE(SCORE!F8,\" / \",SCORE!F9,\" (\",SCORE!G8,\"-\",,SCORE!G9,\")\",\"(\",SCORE!H8,\"-\",SCORE!H9,\")\",\"(\",SCORE!I8,\"-\",SCORE!I9,\")\")","v":"0 / 0 (-)(-)(-)"},null,null,null,null,null,null,{"$f":"IF(SCORE!N9=\"\",\"\",SCORE!N9)","v":""}]
[null,null,null,null,null,null,null,null,null,null,null,null,null,null,"1A"]
[null,null,null,null,null,{"$f":"IF(C27=\" / \",\"TS16\",C27)","v":"TS16"},null,"A3",{"$f":"IF(SCORE!J16=\"\",\"\",SCORE!J16)","v":""}]
[null,"TS 1",{"$f":"CONCATENATE(EMARGEMENT!C9,\" / \",EMARGEMENT!E9)","v":" / "},null,null,{"$f":"IF(C23=\" / \",\"TS8\",C23)","v":"TS8"},null,null,{"$f":"CONCATENATE(SCORE!F16,\" / \",SCORE!F17,\" (\",SCORE!G16,\"-\",,SCORE!G17,\")\",\"(\",SCORE!H16,\"-\",SCORE!H17,\")\",\"(\",SCORE!I16,\"-\",SCORE!I17,\")\")","v":"0 / 0 (-)(-)(-)"},null,null,"A"]
[null,null,null,null,null,null,null,null,null,null,1,{"$f":"SCORE!N9","v":""}]
[null,"TS 8",{"$f":"CONCATENATE(EMARGEMENT!C16,\" / \",EMARGEMENT!E16)","v":" / "},null,null,"A2",null,null,null,null,2,{"$f":"SCORE!N10","v":""},null,"(21)",null,null,{"$f":"SCORE!AK8","v":""}]
[null,null,null,null,null,null,null,{"$f":"IF(SCORE!J12=\"\",\"\",SCORE!J12)","v":""},null,null,3,{"$f":"SCORE!N11","v":""},null,null,null,null,{"$f":"IF(SCORE!AG8=AG9,\"\",CONCATENATE(SCORE!AG8,\" / \",SCORE!AG9,\" (\",SCORE!AH8,\"-\",,SCORE!AH9,\")\",\"(\",SCORE!AI8,\"-\",SCORE!AI9,\")\",\"(\",SCORE!AJ8,\"-\",SCORE!AJ9,\")\"))","v":""}]
[null,"TS 9",{"$f":"CONCATENATE(EMARGEMENT!C17,\" / \",EMARGEMENT!E17)","v":" / "},null,null,{"$f":"IF(C25=\" / \",\"TS9\",C25)","v":"TS9"},null,{"$f":"CONCATENATE(SCORE!F12,\" / \",SCORE!F13,\" (\",SCORE!G12,\"-\",,SCORE!G13,\")\",\"(\",SCORE!H12,\"-\",SCORE!H13,\")\",\"(\",SCORE!I12,\"-\",SCORE!I13,\")\")","v":"0 / 0 (-)(-)(-)"},null,null,4,{"$f":"SCORE!N12","v":""}]
[null,null,null,null,null,{"$f":"IF(SCORE!K8=\"\",\"PMA1\",SCORE!K8)","v":"PMA1"}]
[null,"TS 16",{"$f":"CONCATENATE(EMARGEMENT!C24,\" / \",EMARGEMENT!E24)","v":" / "},null,null,null,null,{"$f":"IF(SCORE!J20=\"\",\"\",SCORE!J20)","v":""}]
[null,null,null,null,null,"A4",null,{"$f":"CONCATENATE(SCORE!F20,\" / \",SCORE!F21,\" (\",SCORE!G20,\"-\",,SCORE!G21,\")\",\"(\",SCORE!H20,\"-\",SCORE!H21,\")\",\"(\",SCORE!I20,\"-\",SCORE!I21,\")\")","v":"0 / 0 (-)(-)(-)"}]
[null,null,null,null,null,null,null,null,{"$f":"IF(SCORE!J24=\"\",\"\",SCORE!J24)","v":""},null,null,null,null,null,"2C"]
[null,null,null,null,null,{"$f":"IF(SCORE!K12=\"\",\"PMA2\",SCORE!K12)","v":"PMA2"},null,"A5",{"$f":"CONCATENATE(SCORE!F24,\" / \",SCORE!F25,\" (\",SCORE!G24,\"-\",,SCORE!G25,\")\",\"(\",SCORE!H24,\"-\",SCORE!H25,\")\",\"(\",SCORE!I24,\"-\",SCORE!I25,\")\")","v":"0 / 0 (-)(-)(-)"},null,null,null,null,null,{"$f":"IF(SCORE!N32=\"\",\"\",SCORE!N32)","v":""}]
[null,null,null,null,null,null,null,null,null,null,null,null,null,null,null,"(25)"]
[null,null,null,null,null,null,null,{"$f":"IF(SCORE!K16=\"\",\"PMA3\",SCORE!K16)","v":"PMA3"},null,null,null,null,null,null,null,null,null,null,{"$f":"SCORE!AK27","v":""}]
[null,null,null,null,null,null,null,null,null,null,null,null,null,null,null,null,null,null,{"$f":"IF(SCORE!AG27=AG27,\"\",CONCATENATE(SCORE!AG27,\" / \",SCORE!AG28,\" (\",SCORE!AH27,\"-\",,SCORE!AH28,\")\",\"(\",SCORE!AI27,\"-\",SCORE!AI28,\")\",\"(\",SCORE!AJ27,\"-\",SCORE!AJ28,\")\"))","v":""}]
[]
[null,null,null,null,null,{"$f":"IF(C40=\" / \",\"TS1\",C40)","v":"TS1"}]
[null,null,null,null,null,null,null,{"$f":"IF(SCORE!X8=\"\",\"\",SCORE!X8)","v":""}]
[null,null,null,null,null,"B1",null,{"$f":"CONCATENATE(SCORE!T8,\" / \",SCORE!T9,\" (\",SCORE!U8,\"-\",,SCORE!U9,\")\",\"(\",SCORE!V8,\"-\",SCORE!V9,\")\",\"(\",SCORE!W8,\"-\",SCORE!W9,\")\")","v":"0 / 0 (-)(-)(-)"},null,null,null,null,null,null,{"$f":"IF(SCORE!AB10=\"\",\"\",SCORE!AB10)","v":""}]
[null,null,null,null,null,null,null,null,null,null,null,null,null,null,"2B"]
[null,null,null,null,null,{"$f":"IF(C46=\" / \",\"TS16\",C46)","v":"TS16"},null,"B3",{"$f":"IF(SCORE!X16=\"\",\"\",SCORE!X16)","v":""}]
[null,"TS 2",{"$f":"CONCATENATE(EMARGEMENT!C10,\" / \",EMARGEMENT!E10)","v":" / "},null,null,{"$f":"IF(C42=\" / \",\"TS8\",C42)","v":"TS8"},null,null,{"$f":"CONCATENATE(SCORE!T16,\" / \",SCORE!T17,\" (\",SCORE!U16,\"-\",,SCORE!U17,\")\",\"(\",SCORE!V16,\"-\",SCORE!V17,\")\",\"(\",SCORE!W16,\"-\",SCORE!W17,\")\")","v":"0 / 0 (-)(-)(-)"},null,null,"B"]
[null,null,null,null,null,null,null,null,null,null,1,{"$f":"SCORE!AB9","v":""}]
[null,"TS 7",{"$f":"CONCATENATE(EMARGEMENT!C15,\" / \",EMARGEMENT!E15)","v":" / "},null,null,"B2",null,null,null,null,2,{"$f":"SCORE!AB10","v":""},null,"(22)"]
[null,null,null,null,null,null,null,{"$f":"IF(SCORE!X12=\"\",\"\",SCORE!X12)","v":""},null,null,3,{"$f":"SCORE!AB11","v":""}]
[null,"TS 10",{"$f":"CONCATENATE(EMARGEMENT!C18,\" / \",EMARGEMENT!E18)","v":" / "},null,null,{"$f":"IF(C44=\" / \",\"TS9\",C44)","v":"TS9"},null,{"$f":"CONCATENATE(SCORE!T12,\" / \",SCORE!T13,\" (\",SCORE!U12,\"-\",,SCORE!U13,\")\",\"(\",SCORE!V12,\"-\",SCORE!V13,\")\",\"(\",SCORE!W12,\"-\",SCORE!W13,\")\")","v":"0 / 0 (-)(-)(-)"},null,null,4,{"$f":"SCORE!AB12","v":""},null,null,null,null,{"$f":"SCORE!AK12","v":""}]
[null,null,null,null,null,{"$f":"IF(SCORE!Y8=\"\",\"PMB1\",SCORE!Y8)","v":"PMB1"},null,null,null,null,null,null,null,null,null,null,{"$f":"IF(SCORE!AG12=AG13,\"\",CONCATENATE(SCORE!AG12,\" / \",SCORE!AG13,\" (\",SCORE!AH12,\"-\",,SCORE!AH13,\")\",\"(\",SCORE!AI12,\"-\",SCORE!AI13,\")\",\"(\",SCORE!AJ12,\"-\",SCORE!AJ13,\")\"))","v":""}]
[null,"TS 15",{"$f":"CONCATENATE(EMARGEMENT!C23,\" / \",EMARGEMENT!E23)","v":" / "},null,null,null,null,{"$f":"IF(SCORE!X20=\"\",\"\",SCORE!X20)","v":""}]
[null,null,null,null,null,"B4",null,{"$f":"CONCATENATE(SCORE!T20,\" / \",SCORE!T21,\" (\",SCORE!U20,\"-\",,SCORE!U21,\")\",\"(\",SCORE!V20,\"-\",SCORE!V21,\")\",\"(\",SCORE!W20,\"-\",SCORE!W21,\")\")","v":"0 / 0 (-)(-)(-)"}]
[null,null,null,null,null,null,null,null,{"$f":"IF(SCORE!X24=\"\",\"\",SCORE!X24)","v":""},null,null,null,null,null,"1D"]
[null,null,null,null,null,{"$f":"IF(SCORE!Y12=\"\",\"PMB2\",SCORE!Y12)","v":"PMB2"},null,"B5",{"$f":"CONCATENATE(SCORE!T24,\" / \",SCORE!T25,\" (\",SCORE!U24,\"-\",,SCORE!U25,\")\",\"(\",SCORE!V24,\"-\",SCORE!V25,\")\",\"(\",SCORE!W24,\"-\",SCORE!W25,\")\")","v":"0 / 0 (-)(-)(-)"},null,null,null,null,null,{"$f":"IF(SCORE!AB31=\"\",\"\",SCORE!AB31)","v":""}]
[null,null,null,null,null,null,null,null,null,null,null,null,null,null,null,null,null,"(28)",null,{"$f":"SCORE!AK44","v":""}]
[null,null,null,null,null,null,null,{"$f":"IF(SCORE!Y16=\"\",\"PMB33\",SCORE!Y16)","v":"PMB33"},null,null,null,null,null,null,null,null,null,null,null,{"$f":"IF(SCORE!AG44=AG44,\"\",CONCATENATE(SCORE!AG44,\" / \",SCORE!AG45,\" (\",SCORE!AH44,\"-\",,SCORE!AH45,\")\",\"(\",SCORE!AI44,\"-\",SCORE!AI45,\")\",\"(\",SCORE!AJ44,\"-\",SCORE!AJ45,\")\"))","v":""}]
[]
[]
[null,null,null,null,null,{"$f":"IF(C59=\" / \",\"TS1\",C59)","v":"TS1"},null,null,null,null,null,null,null,"(23)"]
[null,null,null,null,null,null,null,{"$f":"IF(SCORE!J30=\"\",\"\",SCORE!J30)","v":""}]
[null,null,null,null,null,"C1",null,{"$f":"CONCATENATE(SCORE!F30,\" / \",SCORE!F31,\" (\",SCORE!G30,\"-\",,SCORE!G31,\")\",\"(\",SCORE!H30,\"-\",SCORE!H31,\")\",\"(\",SCORE!I30,\"-\",SCORE!I31,\")\")","v":"0 / 0 (-)(-)(-)"},null,null,null,null,null,null,{"$f":"IF(SCORE!N31=\"\",\"\",SCORE!N31)","v":""}]
[null,null,null,null,null,null,null,null,null,null,null,null,null,null,"1C"]
[null,null,null,null,null,{"$f":"IF(C65=\" / \",\"TS16\",C65)","v":"TS16"},null,"C3",{"$f":"IF(SCORE!J38=\"\",\"\",SCORE!J38)","v":""},null,null,null,null,null,null,"(26)"]
[null,"TS 3",{"$f":"CONCATENATE(EMARGEMENT!C11,\" / \",EMARGEMENT!E11)","v":" / "},null,null,{"$f":"IF(C61=\" / \",\"TS8\",C61)","v":"TS8"},null,null,{"$f":"CONCATENATE(SCORE!F38,\" / \",SCORE!F39,\" (\",SCORE!G38,\"-\",,SCORE!G39,\")\",\"(\",SCORE!H38,\"-\",SCORE!H39,\")\",\"(\",SCORE!I38,\"-\",SCORE!I39,\")\")","v":"0 / 0 (-)(-)(-)"},null,null,"C"]
[null,null,null,null,null,null,null,null,null,null,1,{"$f":"SCORE!N31","v":""}]
[null,"TS 6",{"$f":"CONCATENATE(EMARGEMENT!C14,\" / \",EMARGEMENT!E14)","v":" / "},null,null,"C2",null,null,null,null,2,{"$f":"SCORE!N32","v":""},null,null,null,null,{"$f":"SCORE!AK16","v":""}]
[null,null,null,null,null,null,null,{"$f":"IF(SCORE!J34=\"\",\"\",SCORE!J34)","v":""},null,null,3,{"$f":"SCORE!N33","v":""},null,null,null,null,{"$f":"IF(SCORE!AG16=AG16,\"\",CONCATENATE(SCORE!AG16,\" / \",SCORE!AG17,\" (\",SCORE!AH16,\"-\",,SCORE!AH17,\")\",\"(\",SCORE!AI16,\"-\",SCORE!AI17,\")\",\"(\",SCORE!AJ16,\"-\",SCORE!AJ17,\")\"))","v":""}]
[null,"TS 11",{"$f":"CONCATENATE(EMARGEMENT!C19,\" / \",EMARGEMENT!E19)","v":" / "},null,null,{"$f":"IF(C63=\" / \",\"TS9\",C63)","v":"TS9"},null,{"$f":"CONCATENATE(SCORE!F34,\" / \",SCORE!F35,\" (\",SCORE!G34,\"-\",,SCORE!G35,\")\",\"(\",SCORE!H34,\"-\",SCORE!H35,\")\",\"(\",SCORE!I34,\"-\",SCORE!I35,\")\")","v":"0 / 0 (-)(-)(-)"},null,null,4,{"$f":"SCORE!N34","v":""}]
[null,null,null,null,null,{"$f":"IF(SCORE!K46=\"\",\"PMC1\",SCORE!K46)","v":"PMC1"}]
[null,"TS 14",{"$f":"CONCATENATE(EMARGEMENT!C22,\" / \",EMARGEMENT!E22)","v":" / "},null,null,null,null,{"$f":"IF(SCORE!J42=\"\",\"\",SCORE!J42)","v":""}]
[null,null,null,null,null,"A4",null,{"$f":"CONCATENATE(SCORE!F42,\" / \",SCORE!F43,\" (\",SCORE!G42,\"-\",,SCORE!G43,\")\",\"(\",SCORE!H42,\"-\",SCORE!H43,\")\",\"(\",SCORE!I42,\"-\",SCORE!I43,\")\")","v":"0 / 0 (-)(-)(-)"}]
[null,null,null,null,null,null,null,null,{"$f":"IF(SCORE!J46=\"\",\"\",SCORE!J46)","v":""},null,null,null,null,null,"2A"]
[null,null,null,null,null,{"$f":"IF(SCORE!K34=\"\",\"PMC2\",SCORE!K34)","v":"PMC2"},null,"C5",{"$f":"CONCATENATE(SCORE!F46,\" / \",SCORE!F47,\" (\",SCORE!G46,\"-\",,SCORE!G47,\")\",\"(\",SCORE!H46,\"-\",SCORE!H47,\")\",\"(\",SCORE!I46,\"-\",SCORE!I47,\")\")","v":"0 / 0 (-)(-)(-)"},null,null,null,null,null,{"$f":"IF(SCORE!N10=\"\",\"\",SCORE!N10)","v":""}]
[]
[null,null,null,null,null,null,null,{"$f":"IF(SCORE!K38=\"\",\"PMC3\",SCORE!K38)","v":"PMC3"}]
[null,null,null,null,null,null,null,null,null,null,null,null,null,null,null,null,null,null,{"$f":"SCORE!AK32","v":""}]
[null,null,null,null,null,null,null,null,null,null,null,null,null,null,null,null,null,null,{"$f":"IF(SCORE!AG32=AG32,\"\",CONCATENATE(SCORE!AG32,\" / \",SCORE!AG33,\" (\",SCORE!AH32,\"-\",,SCORE!AH33,\")\",\"(\",SCORE!AI32,\"-\",SCORE!AI33,\")\",\"(\",SCORE!AJ32,\"-\",SCORE!AJ33,\")\"))","v":""}]
[null,null,null,null,null,{"$f":"IF(C78=\" / \",\"TS1\",C78)","v":"TS1"}]
[null,null,null,null,null,null,null,{"$f":"IF(SCORE!X30=\"\",\"\",SCORE!X30)","v":""}]
[null,null,null,null,null,"D1",null,{"$f":"CONCATENATE(SCORE!T30,\" / \",SCORE!T31,\" (\",SCORE!U30,\"-\",,SCORE!U31,\")\",\"(\",SCORE!V30,\"-\",SCORE!V31,\")\",\"(\",SCORE!W30,\"-\",SCORE!W31,\")\")","v":"0 / 0 (-)(-)(-)"},null,null,null,null,null,null,{"$f":"IF(SCORE!AB32=\"\",\"\",SCORE!AB32)","v":""}]
[null,null,null,null,null,null,null,null,null,null,null,null,null,null,"2D"]
[null,null,null,null,null,{"$f":"IF(C84=\" / \",\"TS16\",C84)","v":"TS16"},null,"D3",{"$f":"IF(SCORE!X38=\"\",\"\",SCORE!X38)","v":""}]
[null,"TS 4",{"$f":"CONCATENATE(EMARGEMENT!C12,\" / \",EMARGEMENT!E12)","v":" / "},null,null,{"$f":"IF(C80=\" / \",\"TS8\",C80)","v":"TS8"},null,null,{"$f":"CONCATENATE(SCORE!T38,\" / \",SCORE!T39,\" (\",SCORE!U38,\"-\",,SCORE!U39,\")\",\"(\",SCORE!V38,\"-\",SCORE!V39,\")\",\"(\",SCORE!W38,\"-\",SCORE!W39,\")\")","v":"0 / 0 (-)(-)(-)"},null,null,"D"]
[null,null,null,null,null,null,null,null,null,null,1,{"$f":"SCORE!AB31","v":""}]
[null,"TS 5",{"$f":"CONCATENATE(EMARGEMENT!C13,\" / \",EMARGEMENT!E13)","v":" / "},null,null,"D2",null,null,null,null,2,{"$f":"SCORE!AB32","v":""}]
[null,null,null,null,null,null,null,{"$f":"IF(SCORE!X34=\"\",\"\",SCORE!X34)","v":""},null,null,3,{"$f":"SCORE!AB33","v":""},null,"(24)"]
[null,"TS 12",{"$f":"CONCATENATE(EMARGEMENT!C20,\" / \",EMARGEMENT!E20)","v":" / "},null,null,{"$f":"IF(C82=\" / \",\"TS9\",C82)","v":"TS9"},null,{"$f":"CONCATENATE(SCORE!T34,\" / \",SCORE!T35,\" (\",SCORE!U34,\"-\",,SCORE!U35,\")\",\"(\",SCORE!V34,\"-\",SCORE!V35,\")\",\"(\",SCORE!W34,\"-\",SCORE!W35,\")\")","v":"0 / 0 (-)(-)(-)"},null,null,4,{"$f":"SCORE!AB34","v":""},null,null,null,null,{"$f":"SCORE!AK20","v":""}]
[null,null,null,null,null,{"$f":"IF(SCORE!Y30=\"\",\"PMD1\",SCORE!Y30)","v":"PMD1"},null,null,null,null,null,null,null,null,null,null,{"$f":"IF(SCORE!AG20=AG20,\"\",CONCATENATE(SCORE!AG20,\" / \",SCORE!AG21,\" (\",SCORE!AH20,\"-\",,SCORE!AH21,\")\",\"(\",SCORE!AI20,\"-\",SCORE!AI21,\")\",\"(\",SCORE!AJ20,\"-\",SCORE!AJ21,\")\"))","v":""}]
[null,"TS 13",{"$f":"CONCATENATE(EMARGEMENT!C21,\" / \",EMARGEMENT!E21)","v":" / "},null,null,"PD1",null,{"$f":"IF(SCORE!X42=\"\",\"\",SCORE!X42)","v":""}]
[null,null,null,null,null,"A4",null,{"$f":"CONCATENATE(SCORE!T42,\" / \",SCORE!T43,\" (\",SCORE!U42,\"-\",,SCORE!U43,\")\",\"(\",SCORE!V42,\"-\",SCORE!V43,\")\",\"(\",SCORE!W42,\"-\",SCORE!W43,\")\")","v":"0 / 0 (-)(-)(-)"}]
[null,null,null,null,null,"PD2",null,null,{"$f":"IF(SCORE!X46=\"\",\"\",SCORE!X46)","v":""},null,null,null,null,null,"1B"]
[null,null,null,null,null,{"$f":"IF(SCORE!Y34=\"\",\"PMD2\",SCORE!Y34)","v":"PMD2"},null,"D5",{"$f":"CONCATENATE(SCORE!T46,\" / \",SCORE!T47,\" (\",SCORE!U46,\"-\",,SCORE!U47,\")\",\"(\",SCORE!V46,\"-\",SCORE!V47,\")\",\"(\",SCORE!W46,\"-\",SCORE!W47,\")\")","v":"0 / 0 (-)(-)(-)"},null,null,null,null,null,{"$f":"IF(SCORE!AB9=\"\",\"\",SCORE!AB9)","v":""}]
[]
[null,null,null,null,null,null,null,{"$f":"IF(SCORE!Y38=\"\",\"PMD3\",SCORE!Y38)","v":"PMD3"},null,null,null,null,null,null,null,null,{"$f":"SCORE!AL27","v":""}]
[]
[null,null,null,null,null,null,null,null,null,null,null,null,null,null,null,null,null,"(27)",{"$f":"SCORE!AK38","v":""}]
[null,null,null,null,null,null,null,null,null,null,null,null,null,null,null,null,null,null,{"$f":"IF(SCORE!AG39=AG39,\"\",CONCATENATE(SCORE!AG39,\" / \",SCORE!AG40,\" (\",SCORE!AH39,\"-\",,SCORE!AH40,\")\",\"(\",SCORE!AI39,\"-\",SCORE!AI40,\")\",\"(\",SCORE!AJ39,\"-\",SCORE!AJ40,\")\"))","v":""}]
[]
[null,null,null,null,null,null,null,null,null,null,null,null,null,null,null,null,{"$f":"SCORE!AL32","v":""}]

{"sheet":"PLANNING","index":3,"n_rows":26,"n_cols":17,"rows_kept":26,"cut":false,"hidden":false,"merged":[[0,6,3,12],[4,6,4,9],[4,10,4,12],[5,6,5,13],[0,13,3,13]]}
[null,null,null,null,null,null,{"$f":"IF('LISTE ENGAGES'!Q3=\"\",'LISTE ENGAGES'!P3,'LISTE ENGAGES'!Q3)","v":"APPELATION TOURNOI"},null,null,null,null,null,null,{"$f":"IF('LISTE ENGAGES'!Q10=\"\",'LISTE ENGAGES'!P10,'LISTE ENGAGES'!Q10)","v":"ORGANISATEUR"}]
[]
[]
[]
[null,null,null,null,null,null,{"$f":"IF('LISTE ENGAGES'!Q4=\"\",'LISTE ENGAGES'!P4,'LISTE ENGAGES'!Q4)","v":"LIEU"},null,null,null,{"$f":"IF('LISTE ENGAGES'!Q6=\"\",\"DATE\",CONCATENATE('LISTE ENGAGES'!Q7,\"-\",'LISTE ENGAGES'!Q8,\"/\",'LISTE ENGAGES'!Q9))","v":"DATE"},null,null,{"$f":"IF('LISTE ENGAGES'!Q9=\"\",'LISTE ENGAGES'!P9,'LISTE ENGAGES'!Q9)","v":"GENRE"}]
[null,null,null,null,null,null,"PLANNING MATCH"]
[]
[]
[null,null,null,"JOUR 1","HEURE","MATCH","TERR","EQ1",null,"EQ2","ARB","MATCH","TERR","EQ1",null,"EQ2","ARB"]
["H.DEBUT J1","09:00:00",null,"POULE",{"$f":"B10","v":"09:00:00"},1,null,{"$f":"'TAB BRE 16'!F16","v":"TS1"},"/",{"$f":"'TAB BRE 16'!F20","v":"TS16"},null,2,null,{"$f":"'TAB BRE 16'!F35","v":"TS1"},"/",{"$f":"'TAB BRE 16'!F39","v":"TS16"}]
["TEMPS Match","00:50:00",null,null,{"$f":"E10+$B$11","v":"09:50:00"},3,null,{"$f":"'TAB BRE 16'!F54","v":"TS1"},"/",{"$f":"'TAB BRE 16'!F58","v":"TS16"},null,4,null,{"$f":"'TAB BRE 16'!F73","v":"TS1"},"/",{"$f":"'TAB BRE 16'!F77","v":"TS16"}]
[null,null,null,null,"10:40:00",5,null,{"$f":"'TAB BRE 16'!F21","v":"TS8"},"/",{"$f":"'TAB BRE 16'!F25","v":"TS9"},null,6,null,{"$f":"'TAB BRE 16'!F40","v":"TS8"},"/",{"$f":"'TAB BRE 16'!F44","v":"TS9"}]
["DEBUT J2","09:00:00",null,null,"11:30:00",7,null,{"$f":"'TAB BRE 16'!F59","v":"TS8"},"/",{"$f":"'TAB BRE 16'!F63","v":"TS9"},null,8,null,{"$f":"'TAB BRE 16'!F78","v":"TS8"},"/",{"$f":"'TAB BRE 16'!F82","v":"TS9"}]
["TEMPS Match","00:50:00",null,null,"12:20:00",9,null,{"$f":"'TAB BRE 16'!H17","v":""},"/",{"$f":"'TAB BRE 16'!H24","v":""},null,10,null,{"$f":"'TAB BRE 16'!H36","v":""},"/",{"$f":"'TAB BRE 16'!H43","v":""}]
[null,null,null,null,"13:10:00",11,null,{"$f":"'TAB BRE 16'!H55","v":""},"/",{"$f":"'TAB BRE 16'!H62","v":""},null,12,null,{"$f":"'TAB BRE 16'!H74","v":""},"/",{"$f":"'TAB BRE 16'!H81","v":""}]
[null,null,null,null,"14:00:00",13,null,{"$f":"'TAB BRE 16'!F26","v":"PMA1"},"/",{"$f":"'TAB BRE 16'!F30","v":"PMA2"},null,14,null,{"$f":"'TAB BRE 16'!F45","v":"PMB1"},"/",{"$f":"'TAB BRE 16'!F49","v":"PMB2"}]
[null,null,null,null,"14:50:00",15,null,{"$f":"'TAB BRE 16'!F64","v":"PMC1"},"/",{"$f":"'TAB BRE 16'!F68","v":"PMC2"},null,16,null,{"$f":"'TAB BRE 16'!F83","v":"PMD1"},"/",{"$f":"'TAB BRE 16'!F87","v":"PMD2"}]
[null,null,null,null,"15:40:00",17,null,{"$f":"'TAB BRE 16'!H27","v":""},"/",{"$f":"'TAB BRE 16'!H32","v":"PMA3"},null,18,null,{"$f":"'TAB BRE 16'!H46","v":""},"/",{"$f":"'TAB BRE 16'!H51","v":"PMB33"}]
[null,null,null,null,"16:30:00",19,null,{"$f":"'TAB BRE 16'!H65","v":""},"/",{"$f":"'TAB BRE 16'!H70","v":"PMC3"},null,20,null,{"$f":"'TAB BRE 16'!H84","v":""},"/",{"$f":"'TAB BRE 16'!H89","v":"PMD3"}]
[null,null,null,"QUARTS","17:20:00",21,null,{"$f":"'TAB BRE 16'!O18","v":""},"/",{"$f":"'TAB BRE 16'!O30","v":""},null,22,null,{"$f":"'TAB BRE 16'!O37","v":""},"/",{"$f":"'TAB BRE 16'!O49","v":""}]
[null,null,null,null,"18:10:00",23,null,{"$f":"'TAB BRE 16'!O56","v":""},"/",{"$f":"'TAB BRE 16'!O68","v":""},null,24,null,{"$f":"'TAB BRE 16'!O75","v":""},"/",{"$f":"'TAB BRE 16'!O87","v":""}]
[null,null,null,"JOUR 2"]
[null,null,null,"DEMI",{"$f":"B13","v":"09:00:00"},25,null,{"$f":"'TAB BRE 16'!Q23","v":""},"/",{"$f":"'TAB BRE 16'!Q44","v":""},null,null,null,null,"/"]
[null,null,null,null,{"$f":"E23+$B$14","v":"09:50:00"},26,null,{"$f":"'TAB BRE 16'!Q61","v":""},"/",{"$f":"'TAB BRE 16'!Q82","v":""},null,null,null,null,"/"]
[null,null,null,"PLACE 3/4",{"$f":"E24+$B$14","v":"10:40:00"},27,null,{"$f":"'TAB BRE 16'!Q89","v":""},"/",{"$f":"'TAB BRE 16'!Q94","v":""},null,null,null,null,"/"]
[null,null,null,"FINALE",{"$f":"E25+$B$14","v":"11:30:00"},28,null,{"$f":"'TAB BRE 16'!S32","v":""},"/",{"$f":"'TAB BRE 16'!S71","v":""},null,null,null,null,"/"]

{"sheet":"SCORE","index":4,"n_rows":47,"n_cols":41,"rows_kept":47,"cut":false,"hidden":false,"merged":[]}
[]
[]
[]
[]
[null,null,null,null,null,null,null,null,null,null,null,null,null,null,null,null,null,null,null,null,null,null,null,null,null,null,null,null,null,null,null,"1/4 FINALES"]
[]
[null,null,null,null,null,"SCORE","SET 1","SET 2","SET 3","RG 1","RG 2",null,null,"CLASSEMENT",null,null,null,null,null,"SCORE","SET 1","SET 2","SET 3","RG 1","RG 2",null,null,"CLASSEMENT",null,null,null,null,"SCORE","SET 1","SET 2","SET 3","RG 1","RG 2",null,null,"CALSSEMENT GENERAL"]
[null,null,"(1)","A1",{"$f":"'TAB BRE 16'!C21","v":" / "},{"$f":"SUM(IF(G8>G9,1,0),IF(H8>H9,1,0),IF(I8>I9,1,0))","v":0},null,null,null,{"$f":"IF(F8=F9,\"\",IF(F8>F9,E8,E9))","v":""},{"$f":"IF(F8=F9,\"\",IF(F8<F9,E8,E9))","v":""},null,null,"POULE A",null,null,"(2)","B1",{"$f":"'TAB BRE 16'!C40","v":" / "},{"$f":"SUM(IF(U8>U9,1,0),IF(V8>V9,1,0),IF(W8>W9,1,0))","v":0},null,null,null,{"$f":"IF(T8=T9,\"\",IF(T8>T9,S8,S9))","v":""},{"$f":"IF(T8=T9,\"\",IF(T8<T9,S8,S9))","v":""},null,null,"POULE B",null,"(21)",null,{"$f":"N9","v":""},{"$f":"SUM(IF(AH8>AH9,1,0),IF(AI8>AI9,1,0),IF(AJ8>AJ9,1,0))","v":0},null,null,null,{"$f":"IF(AG8=AG9,\"\",IF(AG8>AG9,AF8,AF9))","v":""},{"$f":"IF(AG8=AG9,\"\",IF(AG8<AG9,AF8,AF9))","v":""},null,1,{"$f":"AK44","v":""}]
[null,null,null,null,{"$f":"'TAB BRE 16'!C27","v":" / "},{"$f":"SUM(IF(G9>G8,1,0),IF(H9>H8,1,0),IF(I9>I8,1,0))","v":0},null,null,null,null,null,null,1,{"$f":"IF(J16=\"\",\"\",J16)","v":""},null,null,null,null,{"$f":"'TAB BRE 16'!C46","v":" / "},{"$f":"SUM(IF(U9>U8,1,0),IF(V9>V8,1,0),IF(W9>W8,1,0))","v":0},null,null,null,null,null,null,1,{"$f":"X16","v":""},null,null,null,{"$f":"N32","v":""},{"$f":"SUM(IF(AH9>AH8,1,0),IF(AI9>AI8,1,0),IF(AJ9>AJ8,1,0))","v":0},null,null,null,null,null,null,2,{"$f":"AL44","v":""}]
[null,null,null,null,null,null,null,null,null,null,null,null,2,{"$f":"J24","v":""},null,null,null,null,null,null,null,null,null,null,null,null,2,{"$f":"X24","v":""},null,null,null,null,null,null,null,null,null,null,null,3,{"$f":"AK38","v":""}]
[null,null,null,null,null,"SCORE","SET 1","SET 2","SET 3","RG 1","RG 2",null,3,{"$f":"K24","v":""},null,null,null,null,null,"SCORE","SET 1","SET 2","SET 3","RG 1","RG 2",null,3,{"$f":"Y24","v":""},null,null,null,null,"SCORE","SET 1","SET 2","SET 3","RG 1","RG 2",null,4,{"$f":"AL38","v":""}]
[null,null,"(5)","A2",{"$f":"'TAB BRE 16'!C23","v":" / "},{"$f":"SUM(IF(G12>G13,1,0),IF(H12>H13,1,0),IF(I12>I13,1,0))","v":0},null,null,null,{"$f":"IF(F12=F13,\"\",IF(F12>F13,E12,E13))","v":""},{"$f":"IF(F12=F13,\"\",IF(F12<F13,E12,E13))","v":""},null,4,{"$f":"K20","v":""},null,null,"(6)","B2",{"$f":"'TAB BRE 16'!C42","v":" / "},{"$f":"SUM(IF(U12>U13,1,0),IF(V12>V13,1,0),IF(W12>W13,1,0))","v":0},null,null,null,{"$f":"IF(T12=T13,\"\",IF(T12>T13,S12,S13))","v":""},{"$f":"IF(T12=T13,\"\",IF(T12<T13,S12,S13))","v":""},null,4,{"$f":"Y20","v":""},null,"(22)",null,{"$f":"AB31","v":""},{"$f":"SUM(IF(AH12>AH13,1,0),IF(AI12>AI13,1,0),IF(AJ12>AJ13,1,0))","v":0},null,null,null,{"$f":"IF(AG12=AG13,\"\",IF(AG12>AG13,AF12,AF13))","v":""},{"$f":"IF(AG12=AG13,\"\",IF(AG12<AG13,AF12,AF13))","v":""},null,5,{"$f":"AL8","v":""}]
[null,null,null,null,{"$f":"'TAB BRE 16'!C25","v":" / "},{"$f":"SUM(IF(G13>G12,1,0),IF(H13>H12,1,0),IF(I13>I12,1,0))","v":0},null,null,null,null,null,null,null,null,null,null,null,null,{"$f":"'TAB BRE 16'!C44","v":" / "},{"$f":"SUM(IF(U13>U12,1,0),IF(V13>V12,1,0),IF(W13>W12,1,0))","v":0},null,null,null,null,null,null,null,null,null,null,null,{"$f":"AB10","v":""},{"$f":"SUM(IF(AH13>AH12,1,0),IF(AI13>AI12,1,0),IF(AJ13>AJ12,1,0))","v":0},null,null,null,null,null,null,5,{"$f":"AL12","v":""}]
[null,null,null,null,null,null,null,null,null,null,null,null,null,null,null,null,null,null,null,null,null,null,null,null,null,null,null,null,null,null,null,null,null,null,null,null,null,null,null,5,{"$f":"AL16","v":""}]
[null,"A",null,null,null,"SCORE","SET 1","SET 2","SET 3","RG 1","RG 2",null,null,null,null,"B",null,null,null,"SCORE","SET 1","SET 2","SET 3","RG 1","RG 2",null,null,null,null,null,null,null,"SCORE","SET 1","SET 2","SET 3","RG 1","RG 2",null,5,{"$f":"AL20","v":""}]
[null,null,"(9)","A3",{"$f":"J8","v":""},{"$f":"SUM(IF(G16>G17,1,0),IF(H16>H17,1,0),IF(I16>I17,1,0))","v":0},null,null,null,{"$f":"IF(F16=F17,\"\",IF(F16>F17,E16,E17))","v":""},{"$f":"IF(F16=F17,\"\",IF(F16<F17,E16,E17))","v":""},null,null,null,null,null,"(10)","B3",{"$f":"X8","v":""},{"$f":"SUM(IF(U16>U17,1,0),IF(V16>V17,1,0),IF(W16>W17,1,0))","v":0},null,null,null,{"$f":"IF(T16=T17,\"\",IF(T16>T17,S16,S17))","v":""},{"$f":"IF(T16=T17,\"\",IF(T16<T17,S16,S17))","v":""},null,null,null,null,"(23)",null,{"$f":"N31","v":""},{"$f":"SUM(IF(AH16>AH17,1,0),IF(AI16>AI17,1,0),IF(AJ16>AJ17,1,0))","v":0},null,null,null,{"$f":"IF(AG16=AG17,\"\",IF(AG16>AG17,AF16,AF17))","v":""},{"$f":"IF(AG16=AG17,\"\",IF(AG16<AG17,AF16,AF17))","v":""},null,9,{"$f":"N11","v":""}]
[null,null,null,null,{"$f":"J12","v":""},{"$f":"SUM(IF(G17>G16,1,0),IF(H17>H16,1,0),IF(I17>I16,1,0))","v":0},null,null,null,null,null,null,null,null,null,null,null,null,{"$f":"X12","v":""},{"$f":"SUM(IF(U17>U16,1,0),IF(V17>V16,1,0),IF(W17>W16,1,0))","v":0},null,null,null,null,null,null,null,null,null,null,null,{"$f":"N10","v":""},{"$f":"SUM(IF(AH17>AH16,1,0),IF(AI17>AI16,1,0),IF(AJ17>AJ16,1,0))","v":0},null,null,null,null,null,null,9,{"$f":"AB11","v":""}]
[null,null,null,null,null,null,null,null,null,null,null,null,null,null,null,null,null,null,null,null,null,null,null,null,null,null,null,null,null,null,null,null,null,null,null,null,null,null,null,9,{"$f":"N33","v":""}]
[null,null,null,null,null,"SCORE","SET 1","SET 2","SET 3","RG 1","RG 2",null,null,null,null,null,null,null,null,"SCORE","SET 1","SET 2","SET 3","RG 1","RG 2",null,null,null,null,null,null,null,"SCORE","SET 1","SET 2","SET 3","RG 1","RG 2",null,9,{"$f":"AB33","v":""}]
[null,null,"(13)","A4",{"$f":"K8","v":""},{"$f":"SUM(IF(G20>G21,1,0),IF(H20>H21,1,0),IF(I20>I21,1,0))","v":0},null,null,null,{"$f":"IF(F20=F21,\"\",IF(F20>F21,E20,E21))","v":""},{"$f":"IF(F20=F21,\"\",IF(F20<F21,E20,E21))","v":""},null,null,null,null,null,"(14)","B4",{"$f":"Y8","v":""},{"$f":"SUM(IF(U20>U21,1,0),IF(V20>V21,1,0),IF(W20>W21,1,0))","v":0},null,null,null,{"$f":"IF(T20=T21,\"\",IF(T20>T21,S20,S21))","v":""},{"$f":"IF(T20=T21,\"\",IF(T20<T21,S20,S21))","v":""},null,null,null,null,"(24)",null,{"$f":"AB9","v":""},{"$f":"SUM(IF(AH20>AH21,1,0),IF(AI20>AI21,1,0),IF(AJ20>AJ21,1,0))","v":0},null,null,null,{"$f":"IF(AG20=AG21,\"\",IF(AG20>AG21,AF20,AF21))","v":""},{"$f":"IF(AG20=AG21,\"\",IF(AG20<AG21,AF20,AF21))","v":""},null,13,{"$f":"N34","v":""}]
[null,null,null,null,{"$f":"K12","v":""},{"$f":"SUM(IF(G21>G20,1,0),IF(H21>H20,1,0),IF(I21>I20,1,0))","v":0},null,null,null,null,null,null,null,null,null,null,null,null,{"$f":"Y12","v":""},{"$f":"SUM(IF(U21>U20,1,0),IF(V21>V20,1,0),IF(W21>W20,1,0))","v":0},null,null,null,null,null,null,null,null,null,null,null,{"$f":"AB32","v":""},{"$f":"SUM(IF(AH21>AH20,1,0),IF(AI21>AI20,1,0),IF(AJ21>AJ20,1,0))","v":0},null,null,null,null,null,null,13,{"$f":"AB12","v":""}]
[null,null,null,null,null,null,null,null,null,null,null,null,null,null,null,null,null,null,null,null,null,null,null,null,null,null,null,null,null,null,null,null,null,null,null,null,null,null,null,13,{"$f":"N12","v":""}]
[null,null,null,null,null,"SCORE","SET 1","SET 2","SET 3","RG 1","RG 2",null,null,null,null,null,null,null,null,"SCORE","SET 1","SET 2","SET 3","RG 1","RG 2",null,null,null,null,null,null,null,null,null,null,null,null,null,null,13,{"$f":"AB34","v":""}]
[null,null,"(17)","A5",{"$f":"K16","v":""},{"$f":"SUM(IF(G24>G25,1,0),IF(H24>H25,1,0),IF(I24>I25,1,0))","v":0},null,null,null,{"$f":"IF(F24=F25,\"\",IF(F24>F25,E24,E25))","v":""},{"$f":"IF(F24=F25,\"\",IF(F24<F25,E24,E25))","v":""},null,null,null,null,null,"(18)","B5",{"$f":"Y16","v":""},{"$f":"SUM(IF(U24>U25,1,0),IF(V24>V25,1,0),IF(W24>W25,1,0))","v":0},null,null,null,{"$f":"IF(T24=T25,\"\",IF(T24>T25,S24,S25))","v":""},{"$f":"IF(T24=T25,\"\",IF(T24<T25,S24,S25))","v":""},null,null,null,null,null,null,"1/2 FINALES"]
[null,null,null,null,{"$f":"J20","v":""},{"$f":"SUM(IF(G25>G24,1,0),IF(H25>H24,1,0),IF(I25>I24,1,0))","v":0},null,null,null,null,null,null,null,null,null,null,null,null,{"$f":"X20","v":""},{"$f":"SUM(IF(U25>U24,1,0),IF(V25>V24,1,0),IF(W25>W24,1,0))","v":0}]
[null,null,null,null,null,null,null,null,null,null,null,null,null,null,null,null,null,null,null,null,null,null,null,null,null,null,null,null,null,null,null,null,"SCORE","SET 1","SET 2","SET 3","RG 1","RG 2"]
[null,null,null,null,null,null,null,null,null,null,null,null,null,null,null,null,null,null,null,null,null,null,null,null,null,null,null,null,null,"(25)",null,{"$f":"AK8","v":""},{"$f":"SUM(IF(AH27>AH28,1,0),IF(AI27>AI28,1,0),IF(AJ27>AJ28,1,0))","v":0},null,null,null,{"$f":"IF(AG27=AG28,\"\",IF(AG27>AG28,AF27,AF28))","v":""},{"$f":"IF(AG27=AG28,\"\",IF(AG27<AG28,AF27,AF28))","v":""}]
[null,null,null,null,null,null,null,null,null,null,null,null,null,null,null,null,null,null,null,null,null,null,null,null,null,null,null,null,null,null,null,{"$f":"AK12","v":""},{"$f":"SUM(IF(AH28>AH27,1,0),IF(AI28>AI27,1,0),IF(AJ28>AJ27,1,0))","v":0}]
[null,null,null,null,null,"SCORE","SET 1","SET 2","SET 3","RG 1","RG 2",null,null,"CLASSEMENT",null,null,null,null,null,"SCORE","SET 1","SET 2","SET 3","RG 1","RG 2",null,null,"CLASSEMENT"]
[null,null,"(3)","C1",{"$f":"'TAB BRE 16'!C59","v":" / "},{"$f":"SUM(IF(G30>G31,1,0),IF(H30>H31,1,0),IF(I30>I31,1,0))","v":0},null,null,null,{"$f":"IF(F30=F31,\"\",IF(F30>F31,E30,E31))","v":""},{"$f":"IF(F30=F31,\"\",IF(F30<F31,E30,E31))","v":""},null,null,"POULE C",null,null,"(4)","D1",{"$f":"'TAB BRE 16'!C78","v":" / "},{"$f":"SUM(IF(U30>U31,1,0),IF(V30>V31,1,0),IF(W30>W31,1,0))","v":0},null,null,null,{"$f":"IF(T30=T31,\"\",IF(T30>T31,S30,S31))","v":""},{"$f":"IF(T30=T31,\"\",IF(T30<T31,S30,S31))","v":""},null,null,"POULE D"]
[null,null,null,null,{"$f":"'TAB BRE 16'!C65","v":" / "},{"$f":"SUM(IF(G31>G30,1,0),IF(H31>H30,1,0),IF(I31>I30,1,0))","v":0},null,null,null,null,null,null,1,{"$f":"J38","v":""},null,null,null,null,{"$f":"'TAB BRE 16'!C84","v":" / "},{"$f":"SUM(IF(U31>U30,1,0),IF(V31>V30,1,0),IF(W31>W30,1,0))","v":0},null,null,null,null,null,null,1,{"$f":"X38","v":""},null,null,null,null,"SCORE","SET 1","SET 2","SET 3","RG 1","RG 2"]
[null,null,null,null,null,null,null,null,null,null,null,null,2,{"$f":"J46","v":""},null,null,null,null,null,null,null,null,null,null,null,null,2,{"$f":"X46","v":""},null,"(26)",null,{"$f":"AK16","v":""},{"$f":"SUM(IF(AH32>AH33,1,0),IF(AI32>AI33,1,0),IF(AJ32>AJ33,1,0))","v":0},null,null,null,{"$f":"IF(AG32=AG33,\"\",IF(AG32>AG33,AF32,AF33))","v":""},{"$f":"IF(AG32=AG33,\"\",IF(AG32<AG33,AF32,AF33))","v":""}]
[null,null,null,null,null,"SCORE","SET 1","SET 2","SET 3","RG 1","RG 2",null,3,{"$f":"K46","v":""},null,null,null,null,null,"SCORE","SET 1","SET 2","SET 3","RG 1","RG 2",null,3,{"$f":"Y46","v":""},null,null,null,{"$f":"AK20","v":""},{"$f":"SUM(IF(AH33>AH32,1,0),IF(AI33>AI32,1,0),IF(AJ33>AJ32,1,0))","v":0}]
[null,null,"(7)","C2",{"$f":"'TAB BRE 16'!C61","v":" / "},{"$f":"SUM(IF(G34>G35,1,0),IF(H34>H35,1,0),IF(I34>I35,1,0))","v":0},null,null,null,{"$f":"IF(F34=F35,\"\",IF(F34>F35,E34,E35))","v":""},{"$f":"IF(F34=F35,\"\",IF(F34<F35,E34,E35))","v":""},null,4,{"$f":"K42","v":""},null,null,"(8)","D2",{"$f":"'TAB BRE 16'!C80","v":" / "},{"$f":"SUM(IF(U34>U35,1,0),IF(V34>V35,1,0),IF(W34>W35,1,0))","v":0},null,null,null,{"$f":"IF(T34=T35,\"\",IF(T34>T35,S34,S35))","v":""},{"$f":"IF(T34=T35,\"\",IF(T34<T35,S34,S35))","v":""},null,4,{"$f":"Y42","v":""}]
[null,null,null,null,{"$f":"'TAB BRE 16'!C63","v":" / "},{"$f":"SUM(IF(G35>G34,1,0),IF(H35>H34,1,0),IF(I35>I34,1,0))","v":0},null,null,null,null,null,null,null,null,null,null,null,null,{"$f":"'TAB BRE 16'!C82","v":" / "},{"$f":"SUM(IF(U35>U34,1,0),IF(V35>V34,1,0),IF(W35>W34,1,0))","v":0},null,null,null,null,null,null,null,null,null,null,null,"PLACE 3/4"]
[]
[null,"C",null,null,null,"SCORE","SET 1","SET 2","SET 3","RG 1","RG 2",null,null,null,null,"D",null,null,null,"SCORE","SET 1","SET 2","SET 3","RG 1","RG 2",null,null,null,null,null,null,null,"SCORE","SET 1","SET 2","SET 3","RG 1","RG 2"]
[null,null,"(11)","C3",{"$f":"J30","v":""},{"$f":"SUM(IF(G38>G39,1,0),IF(H38>H39,1,0),IF(I38>I39,1,0))","v":0},null,null,null,{"$f":"IF(F38=F39,\"\",IF(F38>F39,E38,E39))","v":""},{"$f":"IF(F38=F39,\"\",IF(F38<F39,E38,E39))","v":""},null,null,null,null,null,"(12)","D3",{"$f":"X30","v":""},{"$f":"SUM(IF(U38>U39,1,0),IF(V38>V39,1,0),IF(W38>W39,1,0))","v":0},null,null,null,{"$f":"IF(T38=T39,\"\",IF(T38>T39,S38,S39))","v":""},{"$f":"IF(T38=T39,\"\",IF(T38<T39,S38,S39))","v":""},null,null,null,null,"(27)",null,{"$f":"AL27","v":""},{"$f":"SUM(IF(AH38>AH39,1,0),IF(AI38>AI39,1,0),IF(AJ38>AJ39,1,0))","v":0},null,null,null,{"$f":"IF(AG38=AG39,\"\",IF(AG38>AG39,AF38,AF39))","v":""},{"$f":"IF(AG38=AG39,\"\",IF(AG38<AG39,AF38,AF39))","v":""}]
[null,null,null,null,{"$f":"J34","v":""},{"$f":"SUM(IF(G39>G38,1,0),IF(H39>H38,1,0),IF(I39>I38,1,0))","v":0},null,null,null,null,null,null,null,null,null,null,null,null,{"$f":"X34","v":""},{"$f":"SUM(IF(U39>U38,1,0),IF(V39>V38,1,0),IF(W39>W38,1,0))","v":0},null,null,null,null,null,null,null,null,null,null,null,{"$f":"AL32","v":""},{"$f":"SUM(IF(AH39>AH38,1,0),IF(AI39>AI38,1,0),IF(AJ39>AJ38,1,0))","v":0}]
[]
[null,null,null,null,null,"SCORE","SET 1","SET 2","SET 3","RG 1","RG 2",null,null,null,null,null,null,null,null,"SCORE","SET 1","SET 2","SET 3","RG 1","RG 2",null,null,null,null,null,null,"FINALE"]
[null,null,"(15)","C4",{"$f":"K30","v":""},{"$f":"SUM(IF(G42>G43,1,0),IF(H42>H43,1,0),IF(I42>I43,1,0))","v":0},null,null,null,{"$f":"IF(F42=F43,\"\",IF(F42>F43,E42,E43))","v":""},{"$f":"IF(F42=F43,\"\",IF(F42<F43,E42,E43))","v":""},null,null,null,null,null,"(16)","D4",{"$f":"Y30","v":""},{"$f":"SUM(IF(U42>U43,1,0),IF(V42>V43,1,0),IF(W42>W43,1,0))","v":0},null,null,null,{"$f":"IF(T42=T43,\"\",IF(T42>T43,S42,S43))","v":""},{"$f":"IF(T42=T43,\"\",IF(T42<T43,S42,S43))","v":""}]
[null,null,null,null,{"$f":"K34","v":""},{"$f":"SUM(IF(G43>G42,1,0),IF(H43>H42,1,0),IF(I43>I42,1,0))","v":0},null,null,null,null,null,null,null,null,null,null,null,null,{"$f":"Y34","v":""},{"$f":"SUM(IF(U43>U42,1,0),IF(V43>V42,1,0),IF(W43>W42,1,0))","v":0},null,null,null,null,null,null,null,null,null,"(28)",null,null,"SCORE","SET 1","SET 2","SET 3","RG 1","RG 2"]
[null,null,null,null,null,null,null,null,null,null,null,null,null,null,null,null,null,null,null,null,null,null,null,null,null,null,null,null,null,null,null,{"$f":"AK27","v":""},{"$f":"SUM(IF(AH44>AH45,1,0),IF(AI44>AI45,1,0),IF(AJ44>AJ45,1,0))","v":0},null,null,null,{"$f":"IF(AG44=AG45,\"\",IF(AG44>AG45,AF44,AF45))","v":""},{"$f":"IF(AG44=AG45,\"\",IF(AG44<AG45,AF44,AF45))","v":""}]
[null,null,null,null,null,"SCORE","SET 1","SET 2","SET 3","RG 1","RG 2",null,null,null,null,null,null,null,null,"SCORE","SET 1","SET 2","SET 3","RG 1","RG 2",null,null,null,null,null,null,{"$f":"AK32","v":""},{"$f":"SUM(IF(AH45>AH44,1,0),IF(AI45>AI44,1,0),IF(AJ45>AJ44,1,0))","v":0}]
[null,null,"(19)","C5",{"$f":"K38","v":""},{"$f":"SUM(IF(G46>G47,1,0),IF(H46>H47,1,0),IF(I46>I47,1,0))","v":0},null,null,null,{"$f":"IF(F46=F47,\"\",IF(F46>F47,E46,E47))","v":""},{"$f":"IF(F46=F47,\"\",IF(F46<F47,E46,E47))","v":""},null,null,null,null,null,"(20)","D5",{"$f":"Y38","v":""},{"$f":"SUM(IF(U46>U47,1,0),IF(V46>V47,1,0),IF(W46>W47,1,0))","v":0},null,null,null,{"$f":"IF(T46=T47,\"\",IF(T46>T47,S46,S47))","v":""},{"$f":"IF(T46=T47,\"\",IF(T46<T47,S46,S47))","v":""}]
[null,null,null,null,{"$f":"J42","v":""},{"$f":"SUM(IF(G47>G46,1,0),IF(H47>H46,1,0),IF(I47>I46,1,0))","v":0},null,null,null,null,null,null,null,null,null,null,null,null,{"$f":"X42","v":""},{"$f":"SUM(IF(U47>U46,1,0),IF(V47>V46,1,0),IF(W47>W46,1,0))","v":0}]

{"sheet":"RELEVE","index":5,"n_rows":82,"n_cols":13,"rows_kept":82,"cut":false,"hidden":false,"merged":[[81,1,87,9],[14,3,14,5],[15,1,15,2],[15,3,15,5],[16,1,16,2],[16,3,16,5],[17,1,17,2],[17,3,17,5],[18,1,18,2],[18,3,18,5],[19,1,19,2],[19,3,19,5],[72,1,78,9],[9,7,9,8],[2,1,2,2],[2,3,2,9],[3,1,3,2],[3,3,3,4],[4,1,4,2],[4,3,4,4],[5,1,5,2],[5,3,5,4],[6,1,6,2],[6,3,6,4],[8,7,8,8]]}
[null,"RELEVE DES RESULTATS ET SANCTIONS - TOURNOI DE BEACH VOLLEY"]
[]
[null,"APPELATION DU TOURNOI",null,{"$f":"IF('LISTE ENGAGES'!Q4=\"\",\"\",'LISTE ENGAGES'!Q4)","v":""}]
[null,"TYPE",null,{"$f":"IF('LISTE ENGAGES'!Q5=\"\",\"\",'LISTE ENGAGES'!Q5)","v":""}]
[null,"GENRE",null,{"$f":"IF('LISTE ENGAGES'!Q9=\"\",\"\",'LISTE ENGAGES'!Q9)","v":""}]
[null,"DATE",null,{"$f":"IF('LISTE ENGAGES'!Q7=\"\",\"\",CONCATENATE('LISTE ENGAGES'!Q7,\"-\",'LISTE ENGAGES'!Q8,\"/\",'LISTE ENGAGES'!Q6))","v":""}]
[null,"ORGANISATEUR",null,{"$f":"IF('LISTE ENGAGES'!Q10=\"\",\"\",'LISTE ENGAGES'!Q10)","v":""}]
[]
[null,"NOMBRE EQUIPE TABLEAU :",null,null,"PRINCIPAL",null,null,"QUALIFICATION"]
[null,"NOMBRE EQUIPE PRESENTES PAR TABLEAU",null,null,"PRINCIPAL",null,null,"QUALIFICATION"]
[]
[]
[null,"COMPOSITION DE LA COMMISSION DE DIRECTION"]
[]
[null,"DELEGUE INSTANCE FEDERAL"]
[null,"SUPERVISEUR"]
[null,"JUGE ARBITRE"]
[null,"ORGANISATEUR"]
[null,"REPRESENTANT JOUEURS"]
[null,"RAPPORTEUR*"]
[]
[]
[]
[]
[]
[null,"EQUIPES ABSENTES"]
[null,"NOM","PRENOM","LIC J1","club J1","NOM2","PRENOM3","LIC J2","club J2"]
[]
[]
[]
[]
[]
[]
[null,"RECLAMATIONS"]
[null,"NOM","PRENOM","LIC J1","club J1","NOM2","PRENOM3","LIC J2","club J2","RANG","NIVEAU","MOTIF ","AVIS COMMISSION"]
[1]
[2]
[3]
[4]
[5]
[6]
[]
[null,"EQUIPES/JOUEURS SANCTIONNES"]
[null,"NOM","PRENOM","LIC J1","club J1","NOM2","PRENOM3","LIC J2","club J2","RANG","SANCTION","MOTIF ","AVIS COMMISSION"]
[1]
[2]
[3]
[4]
[5]
[6]
[]
[null,"CLASSEMENT FINAL"]
[null,"NOM","PRENOM","LIC J1","club J1","NOM2","PRENOM3","LIC J2","club J2","RANG"]
[null,{"$f":"IF('LISTE ENGAGES'!C9=\"\",\"\",'LISTE ENGAGES'!C9)","v":""},{"$f":"IF('LISTE ENGAGES'!D9=\"\",\"\",'LISTE ENGAGES'!D9)","v":""},{"$f":"IF('LISTE ENGAGES'!E9=\"\",\"\",'LISTE ENGAGES'!E9)","v":""},{"$f":"IF('LISTE ENGAGES'!F9=\"\",\"\",'LISTE ENGAGES'!F9)","v":""},{"$f":"IF('LISTE ENGAGES'!G9=\"\",\"\",'LISTE ENGAGES'!G9)","v":""},{"$f":"IF('LISTE ENGAGES'!H9=\"\",\"\",'LISTE ENGAGES'!H9)","v":""},{"$f":"IF('LISTE ENGAGES'!I9=\"\",\"\",'LISTE ENGAGES'!I9)","v":""},{"$f":"IF('LISTE ENGAGES'!J9=\"\",\"\",'LISTE ENGAGES'!J9)","v":""}]
[null,{"$f":"IF('LISTE ENGAGES'!C10=\"\",\"\",'LISTE ENGAGES'!C10)","v":""},{"$f":"IF('LISTE ENGAGES'!D10=\"\",\"\",'LISTE ENGAGES'!D10)","v":""},{"$f":"IF('LISTE ENGAGES'!E10=\"\",\"\",'LISTE ENGAGES'!E10)","v":""},{"$f":"IF('LISTE ENGAGES'!F10=\"\",\"\",'LISTE ENGAGES'!F10)","v":""},{"$f":"IF('LISTE ENGAGES'!G10=\"\",\"\",'LISTE ENGAGES'!G10)","v":""},{"$f":"IF('LISTE ENGAGES'!H10=\"\",\"\",'LISTE ENGAGES'!H10)","v":""},{"$f":"IF('LISTE ENGAGES'!I10=\"\",\"\",'LISTE ENGAGES'!I10)","v":""},{"$f":"IF('LISTE ENGAGES'!J10=\"\",\"\",'LISTE ENGAGES'!J10)","v":""}]
[null,{"$f":"IF('LISTE ENGAGES'!C11=\"\",\"\",'LISTE ENGAGES'!C11)","v":""},{"$f":"IF('LISTE ENGAGES'!D11=\"\",\"\",'LISTE ENGAGES'!D11)","v":""},{"$f":"IF('LISTE ENGAGES'!E11=\"\",\"\",'LISTE ENGAGES'!E11)","v":""},{"$f":"IF('LISTE ENGAGES'!F11=\"\",\"\",'LISTE ENGAGES'!F11)","v":""},{"$f":"IF('LISTE ENGAGES'!G11=\"\",\"\",'LISTE ENGAGES'!G11)","v":""},{"$f":"IF('LISTE ENGAGES'!H11=\"\",\"\",'LISTE ENGAGES'!H11)","v":""},{"$f":"IF('LISTE ENGAGES'!I11=\"\",\"\",'LISTE ENGAGES'!I11)","v":""},{"$f":"IF('LISTE ENGAGES'!J11=\"\",\"\",'LISTE ENGAGES'!J11)","v":""}]
[null,{"$f":"IF('LISTE ENGAGES'!C12=\"\",\"\",'LISTE ENGAGES'!C12)","v":""},{"$f":"IF('LISTE ENGAGES'!D12=\"\",\"\",'LISTE ENGAGES'!D12)","v":""},{"$f":"IF('LISTE ENGAGES'!E12=\"\",\"\",'LISTE ENGAGES'!E12)","v":""},{"$f":"IF('LISTE ENGAGES'!F12=\"\",\"\",'LISTE ENGAGES'!F12)","v":""},{"$f":"IF('LISTE ENGAGES'!G12=\"\",\"\",'LISTE ENGAGES'!G12)","v":""},{"$f":"IF('LISTE ENGAGES'!H12=\"\",\"\",'LISTE ENGAGES'!H12)","v":""},{"$f":"IF('LISTE ENGAGES'!I12=\"\",\"\",'LISTE ENGAGES'!I12)","v":""},{"$f":"IF('LISTE ENGAGES'!J12=\"\",\"\",'LISTE ENGAGES'!J12)","v":""}]
[null,{"$f":"IF('LISTE ENGAGES'!C13=\"\",\"\",'LISTE ENGAGES'!C13)","v":""},{"$f":"IF('LISTE ENGAGES'!D13=\"\",\"\",'LISTE ENGAGES'!D13)","v":""},{"$f":"IF('LISTE ENGAGES'!E13=\"\",\"\",'LISTE ENGAGES'!E13)","v":""},{"$f":"IF('LISTE ENGAGES'!F13=\"\",\"\",'LISTE ENGAGES'!F13)","v":""},{"$f":"IF('LISTE ENGAGES'!G13=\"\",\"\",'LISTE ENGAGES'!G13)","v":""},{"$f":"IF('LISTE ENGAGES'!H13=\"\",\"\",'LISTE ENGAGES'!H13)","v":""},{"$f":"IF('LISTE ENGAGES'!I13=\"\",\"\",'LISTE ENGAGES'!I13)","v":""},{"$f":"IF('LISTE ENGAGES'!J13=\"\",\"\",'LISTE ENGAGES'!J13)","v":""}]
[null,{"$f":"IF('LISTE ENGAGES'!C14=\"\",\"\",'LISTE ENGAGES'!C14)","v":""},{"$f":"IF('LISTE ENGAGES'!D14=\"\",\"\",'LISTE ENGAGES'!D14)","v":""},{"$f":"IF('LISTE ENGAGES'!E14=\"\",\"\",'LISTE ENGAGES'!E14)","v":""},{"$f":"IF('LISTE ENGAGES'!F14=\"\",\"\",'LISTE ENGAGES'!F14)","v":""},{"$f":"IF('LISTE ENGAGES'!G14=\"\",\"\",'LISTE ENGAGES'!G14)","v":""},{"$f":"IF('LISTE ENGAGES'!H14=\"\",\"\",'LISTE ENGAGES'!H14)","v":""},{"$f":"IF('LISTE ENGAGES'!I14=\"\",\"\",'LISTE ENGAGES'!I14)","v":""},{"$f":"IF('LISTE ENGAGES'!J14=\"\",\"\",'LISTE ENGAGES'!J14)","v":""}]
[null,{"$f":"IF('LISTE ENGAGES'!C15=\"\",\"\",'LISTE ENGAGES'!C15)","v":""},{"$f":"IF('LISTE ENGAGES'!D15=\"\",\"\",'LISTE ENGAGES'!D15)","v":""},{"$f":"IF('LISTE ENGAGES'!E15=\"\",\"\",'LISTE ENGAGES'!E15)","v":""},{"$f":"IF('LISTE ENGAGES'!F15=\"\",\"\",'LISTE ENGAGES'!F15)","v":""},{"$f":"IF('LISTE ENGAGES'!G15=\"\",\"\",'LISTE ENGAGES'!G15)","v":""},{"$f":"IF('LISTE ENGAGES'!H15=\"\",\"\",'LISTE ENGAGES'!H15)","v":""},{"$f":"IF('LISTE ENGAGES'!I15=\"\",\"\",'LISTE ENGAGES'!I15)","v":""},{"$f":"IF('LISTE ENGAGES'!J15=\"\",\"\",'LISTE ENGAGES'!J15)","v":""}]
[null,{"$f":"IF('LISTE ENGAGES'!C16=\"\",\"\",'LISTE ENGAGES'!C16)","v":""},{"$f":"IF('LISTE ENGAGES'!D16=\"\",\"\",'LISTE ENGAGES'!D16)","v":""},{"$f":"IF('LISTE ENGAGES'!E16=\"\",\"\",'LISTE ENGAGES'!E16)","v":""},{"$f":"IF('LISTE ENGAGES'!F16=\"\",\"\",'LISTE ENGAGES'!F16)","v":""},{"$f":"IF('LISTE ENGAGES'!G16=\"\",\"\",'LISTE ENGAGES'!G16)","v":""},{"$f":"IF('LISTE ENGAGES'!H16=\"\",\"\",'LISTE ENGAGES'!H16)","v":""},{"$f":"IF('LISTE ENGAGES'!I16=\"\",\"\",'LISTE ENGAGES'!I16)","v":""},{"$f":"IF('LISTE ENGAGES'!J16=\"\",\"\",'LISTE ENGAGES'!J16)","v":""}]
[null,{"$f":"IF('LISTE ENGAGES'!C17=\"\",\"\",'LISTE ENGAGES'!C17)","v":""},{"$f":"IF('LISTE ENGAGES'!D17=\"\",\"\",'LISTE ENGAGES'!D17)","v":""},{"$f":"IF('LISTE ENGAGES'!E17=\"\",\"\",'LISTE ENGAGES'!E17)","v":""},{"$f":"IF('LISTE ENGAGES'!F17=\"\",\"\",'LISTE ENGAGES'!F17)","v":""},{"$f":"IF('LISTE ENGAGES'!G17=\"\",\"\",'LISTE ENGAGES'!G17)","v":""},{"$f":"IF('LISTE ENGAGES'!H17=\"\",\"\",'LISTE ENGAGES'!H17)","v":""},{"$f":"IF('LISTE ENGAGES'!I17=\"\",\"\",'LISTE ENGAGES'!I17)","v":""},{"$f":"IF('LISTE ENGAGES'!J17=\"\",\"\",'LISTE ENGAGES'!J17)","v":""}]
[null,{"$f":"IF('LISTE ENGAGES'!C18=\"\",\"\",'LISTE ENGAGES'!C18)","v":""},{"$f":"IF('LISTE ENGAGES'!D18=\"\",\"\",'LISTE ENGAGES'!D18)","v":""},{"$f":"IF('LISTE ENGAGES'!E18=\"\",\"\",'LISTE ENGAGES'!E18)","v":""},{"$f":"IF('LISTE ENGAGES'!F18=\"\",\"\",'LISTE ENGAGES'!F18)","v":""},{"$f":"IF('LISTE ENGAGES'!G18=\"\",\"\",'LISTE ENGAGES'!G18)","v":""},{"$f":"IF('LISTE ENGAGES'!H18=\"\",\"\",'LISTE ENGAGES'!H18)","v":""},{"$f":"IF('LISTE ENGAGES'!I18=\"\",\"\",'LISTE ENGAGES'!I18)","v":""},{"$f":"IF('LISTE ENGAGES'!J18=\"\",\"\",'LISTE ENGAGES'!J18)","v":""}]
[null,{"$f":"IF('LISTE ENGAGES'!C19=\"\",\"\",'LISTE ENGAGES'!C19)","v":""},{"$f":"IF('LISTE ENGAGES'!D19=\"\",\"\",'LISTE ENGAGES'!D19)","v":""},{"$f":"IF('LISTE ENGAGES'!E19=\"\",\"\",'LISTE ENGAGES'!E19)","v":""},{"$f":"IF('LISTE ENGAGES'!F19=\"\",\"\",'LISTE ENGAGES'!F19)","v":""},{"$f":"IF('LISTE ENGAGES'!G19=\"\",\"\",'LISTE ENGAGES'!G19)","v":""},{"$f":"IF('LISTE ENGAGES'!H19=\"\",\"\",'LISTE ENGAGES'!H19)","v":""},{"$f":"IF('LISTE ENGAGES'!I19=\"\",\"\",'LISTE ENGAGES'!I19)","v":""},{"$f":"IF('LISTE ENGAGES'!J19=\"\",\"\",'LISTE ENGAGES'!J19)","v":""}]
[null,{"$f":"IF('LISTE ENGAGES'!C20=\"\",\"\",'LISTE ENGAGES'!C20)","v":""},{"$f":"IF('LISTE ENGAGES'!D20=\"\",\"\",'LISTE ENGAGES'!D20)","v":""},{"$f":"IF('LISTE ENGAGES'!E20=\"\",\"\",'LISTE ENGAGES'!E20)","v":""},{"$f":"IF('LISTE ENGAGES'!F20=\"\",\"\",'LISTE ENGAGES'!F20)","v":""},{"$f":"IF('LISTE ENGAGES'!G20=\"\",\"\",'LISTE ENGAGES'!G20)","v":""},{"$f":"IF('LISTE ENGAGES'!H20=\"\",\"\",'LISTE ENGAGES'!H20)","v":""},{"$f":"IF('LISTE ENGAGES'!I20=\"\",\"\",'LISTE ENGAGES'!I20)","v":""},{"$f":"IF('LISTE ENGAGES'!J20=\"\",\"\",'LISTE ENGAGES'!J20)","v":""}]
[null,{"$f":"IF('LISTE ENGAGES'!C21=\"\",\"\",'LISTE ENGAGES'!C21)","v":""},{"$f":"IF('LISTE ENGAGES'!D21=\"\",\"\",'LISTE ENGAGES'!D21)","v":""},{"$f":"IF('LISTE ENGAGES'!E21=\"\",\"\",'LISTE ENGAGES'!E21)","v":""},{"$f":"IF('LISTE ENGAGES'!F21=\"\",\"\",'LISTE ENGAGES'!F21)","v":""},{"$f":"IF('LISTE ENGAGES'!G21=\"\",\"\",'LISTE ENGAGES'!G21)","v":""},{"$f":"IF('LISTE ENGAGES'!H21=\"\",\"\",'LISTE ENGAGES'!H21)","v":""},{"$f":"IF('LISTE ENGAGES'!I21=\"\",\"\",'LISTE ENGAGES'!I21)","v":""},{"$f":"IF('LISTE ENGAGES'!J21=\"\",\"\",'LISTE ENGAGES'!J21)","v":""}]
[null,{"$f":"IF('LISTE ENGAGES'!C22=\"\",\"\",'LISTE ENGAGES'!C22)","v":""},{"$f":"IF('LISTE ENGAGES'!D22=\"\",\"\",'LISTE ENGAGES'!D22)","v":""},{"$f":"IF('LISTE ENGAGES'!E22=\"\",\"\",'LISTE ENGAGES'!E22)","v":""},{"$f":"IF('LISTE ENGAGES'!F22=\"\",\"\",'LISTE ENGAGES'!F22)","v":""},{"$f":"IF('LISTE ENGAGES'!G22=\"\",\"\",'LISTE ENGAGES'!G22)","v":""},{"$f":"IF('LISTE ENGAGES'!H22=\"\",\"\",'LISTE ENGAGES'!H22)","v":""},{"$f":"IF('LISTE ENGAGES'!I22=\"\",\"\",'LISTE ENGAGES'!I22)","v":""},{"$f":"IF('LISTE ENGAGES'!J22=\"\",\"\",'LISTE ENGAGES'!J22)","v":""}]
[null,{"$f":"IF('LISTE ENGAGES'!C23=\"\",\"\",'LISTE ENGAGES'!C23)","v":""},{"$f":"IF('LISTE ENGAGES'!D23=\"\",\"\",'LISTE ENGAGES'!D23)","v":""},{"$f":"IF('LISTE ENGAGES'!E23=\"\",\"\",'LISTE ENGAGES'!E23)","v":""},{"$f":"IF('LISTE ENGAGES'!F23=\"\",\"\",'LISTE ENGAGES'!F23)","v":""},{"$f":"IF('LISTE ENGAGES'!G23=\"\",\"\",'LISTE ENGAGES'!G23)","v":""},{"$f":"IF('LISTE ENGAGES'!H23=\"\",\"\",'LISTE ENGAGES'!H23)","v":""},{"$f":"IF('LISTE ENGAGES'!I23=\"\",\"\",'LISTE ENGAGES'!I23)","v":""},{"$f":"IF('LISTE ENGAGES'!J23=\"\",\"\",'LISTE ENGAGES'!J23)","v":""}]
[null,{"$f":"IF('LISTE ENGAGES'!C24=\"\",\"\",'LISTE ENGAGES'!C24)","v":""},{"$f":"IF('LISTE ENGAGES'!D24=\"\",\"\",'LISTE ENGAGES'!D24)","v":""},{"$f":"IF('LISTE ENGAGES'!E24=\"\",\"\",'LISTE ENGAGES'!E24)","v":""},{"$f":"IF('LISTE ENGAGES'!F24=\"\",\"\",'LISTE ENGAGES'!F24)","v":""},{"$f":"IF('LISTE ENGAGES'!G24=\"\",\"\",'LISTE ENGAGES'!G24)","v":""},{"$f":"IF('LISTE ENGAGES'!H24=\"\",\"\",'LISTE ENGAGES'!H24)","v":""},{"$f":"IF('LISTE ENGAGES'!I24=\"\",\"\",'LISTE ENGAGES'!I24)","v":""},{"$f":"IF('LISTE ENGAGES'!J24=\"\",\"\",'LISTE ENGAGES'!J24)","v":""}]
[]
[]
[]
[null,"REMARQUES :"]
[]
[]
[]
[]
[]
[]
[]
[]
[null,"SIGNATURES :"]