{"text_format":"1","workbook":"xlsx","n_sheets":11,"sheets":["LISTE","LISTE ENGAGES","EMARG M Tableau QUALIF","PLANNING PS 24 QUALIF","SCORE 24 QUALIF","TAB 24 P+B QUALIF","EMARG M Tableau PRIN","PLANNING PS 24","SCORE 24 PRINC","TAB24 POULE","RELEVE"],"not_rendered":{"charts":0,"images":5,"macros":1,"external_links":0,"defined_names":46,"comments":0,"pivot_tables":0},"unopened":[],"bounds":{"document_bytes":16777216,"sheet_cells":100000,"rows_first":2000,"rows_last":500,"rows_between":2000,"halvings":0,"cell_chars":16384,"cell_head_chars":4096},"cells_cut":0,"cells_raw":0,"read":"whole","date_system":"1900"}

{"sheet":"LISTE","index":0,"n_rows":18,"n_cols":9,"rows_kept":18,"cut":false,"hidden":true,"merged":[]}
[]
[]
[]
[]
[]
[]
[null,null,"CHAMPIONNAT DE France",null,2020,null,"MASCULIN",null,"ABS"]
[null,null,"SERIE 1 - 2500",null,2021,null,"FEMININ",null,1]
[null,null,"SERIE 1 - 2000",null,2022,null,"MIXTE",null,2]
[null,null,"SERIE 1 - 1500",null,2023,null,null,null,3]
[null,null,"SERIE 2 - 1000",null,2024,null,null,null,4]
[null,null,"SERIE 2 - 750",null,null,null,null,null,5]
[null,null,"SERIE 2 - 500",null,null,null,null,null,7]
[null,null,"SERIE 2 - 250",null,null,null,null,null,9]
[null,null,"SERIE 3 - 150",null,null,null,null,null,13]
[null,null,"SERIE 3 - 100",null,null,null,null,null,17]
[null,null,null,null,null,null,null,null,25]
[null,null,null,null,null,null,null,null,32]

{"sheet":"LISTE ENGAGES","index":1,"n_rows":56,"n_cols":18,"rows_kept":56,"cut":false,"hidden":false,"merged":[[12,14,12,18],[0,2,2,6],[0,7,2,7],[3,2,3,3],[4,2,4,7],[5,2,5,7],[11,14,11,18]]}
[null,null,{"$f":"IF($R$3=\"\",$Q$3,$R$3)","v":"APPELATION TOURNOI"},null,null,null,null,{"$f":"IF(R10=\"\",Q10,R10)","v":"ORGANISATEUR"}]
[null,null,null,null,null,null,null,null,null,null,null,null,null,null,null,null,null,"IDENTITE DU TOURNOI"]
[null,null,null,null,null,null,null,null,null,null,null,null,null,null,null,null,"APPELATION TOURNOI"]
[null,null,{"$f":"IF($R$4=\"\",$Q$4,$R$4)","v":"LIEU"},null,null,null,{"$f":"IF(R7=\"\",\"DATE\",CONCATENATE(R7,\"-\",R8,\"/\",R6))","v":"DATE"},{"$f":"IF(R9=\"\",Q9,R9)","v":"GENRE"},null,null,null,null,null,null,null,null,"LIEU"]
[null,null,{"$f":"IF(R5=\"\",Q5,R5)","v":"TYPE"},null,null,null,null,null,null,null,null,null,null,null,null,null,"TYPE"]
[null,null,"LISTE EQUIPES ENGAGEES",null,null,null,null,null,null,null,null,null,null,null,null,null,"ANNEE"]
[null,null,null,null,null,null,null,null,null,null,null,null,null,null,null,null,"DATE DEBUT"]
["N°",null,"NOM","PRENOM","LIC","CLUB","NOM","PRENOM","LIC","CLUB","pts","tir",null,null,null,null,"DATE FIN"]
[1,null,"T",null,null,null,1,null,null,null,null,null,null,null,null,null,"GENRE"]
[2,null,"T",null,null,null,2,null,null,null,null,null,null,null,null,null,"ORGANISATEUR"]
[3,null,"T",null,null,null,3]
[4,null,"T",null,null,null,4,null,null,null,null,null,null,null,"1- Commencez par renseigner le tableau ci-dessus \"identité du tournoi\""]
[5,null,"T",null,null,null,5,null,null,null,null,null,null,null,"2- Copiez-collez la liste des équipes engagées dans les champs ci-contre en respectant : "]
[6,null,"T",null,null,null,6,null,null,null,null,null,null,null,"- nom et premon séparés pour chaque joueur ( à défaut, ne mentionez que le nom)"]
[7,null,"T",null,null,null,7,null,null,null,null,null,null,null,"- l'ordre décroissant des têtes de séries"]
[8,null,"T",null,null,null,8,null,null,null,null,null,null,null,"3- Renseignez l'onglet \"EMARG….\" selon l'avancée dans les tableaux"]
[9,null,"T",null,null,null,9,null,null,null,null,null,null,null,"4-Renseignez les scores des rencontres dans l'onglet \" SCORE…\" en fonction de l'avancée du tableau"]
[10,null,"T",null,null,null,10,null,null,null,null,null,null,null,"Les onglets \"TAB24…\" s'actualisent automatiquement, il n'y a rien à saisir."]
[11,null,"T",null,null,null,11,null,null,null,null,null,null,null,"5- Renseignez l'onglet \"RELEVE\" à l'issue de la compétition"]
[12,null,"T",null,null,null,12]
[13,null,"T",null,null,null,13]
[14,null,"T",null,null,null,14]
[15,null,"T",null,null,null,15]
[16,null,"T",null,null,null,16]
[17,null,"T",null,null,null,17]
[18,null,"T",null,null,null,18]
[19,null,"T",null,null,null,19]
[20,null,"T",null,null,null,20]
[21,null,"T",null,null,null,21]
[22,null,"T",null,null,null,22]
[23,null,"T",null,null,null,23]
[24,null,"T",null,null,null,24]
[25,null,"T",null,null,null,25]
[26,null,"T",null,null,null,26]
[27,null,"T",null,null,null,27]
[28,null,"T",null,null,null,28]
[29,null,"T",null,null,null,29]
[30,null,"T",null,null,null,30]
[31,null,"T",null,null,null,31]
[32,null,"T",null,null,null,32]
[33,null,"T",null,null,null,33]
[34,null,"T",null,null,null,34]
[35,null,"T",null,null,null,35]
[36,null,"T",null,null,null,36]
[37,null,"T",null,null,null,37]
[38,null,"T",null,null,null,38]
[39,null,"T",null,null,null,39]
[40,null,"T",null,null,null,40]
[41,null,"T",null,null,null,41]
[42,null,"T",null,null,null,42]
[43,null,"T",null,null,null,43]
[44,null,"T",null,null,null,44]
[45,null,"T",null,null,null,45]
[46,null,"T",null,null,null,46]
[47,null,"T",null,null,null,47]
[48,null,"T",null,null,null,48]

{"sheet":"EMARG M Tableau QUALIF","index":2,"n_rows":37,"n_cols":10,"rows_kept":37,"cut":false,"hidden":false,"merged":[[5,3,5,9],[1,3,2,8],[1,9,3,9],[3,3,3,4],[3,5,3,7],[4,3,4,9]]}
[]
[null,null,null,{"$f":"IF('LISTE ENGAGES'!R3=\"\",'LISTE ENGAGES'!Q3,'LISTE ENGAGES'!R3)","v":"APPELATION TOURNOI"},null,null,null,null,null,{"$f":"'LISTE ENGAGES'!$H$1","v":"ORGANISATEUR"}]
[]
[null,null,null,{"$f":"'LISTE ENGAGES'!$C$4","v":"LIEU"},null,{"$f":"'LISTE ENGAGES'!$G$4","v":"DATE"},null,null,{"$f":"'LISTE ENGAGES'!$H$4","v":"GENRE"}]
[null,null,null,{"$f":"'LISTE ENGAGES'!$C$5","v":"TYPE"}]
[null,null,null,"FEUILLE EMARGEMENT"]
[]
["N°",null,"NOM","PRENOM","NOM","PRENOM","pts","tir","SIGNATURE JOUEUR1","SIGNATURE JOUEUR2"]
[1,null,"T",null,1]
[2,null,"T",null,2]
[3,null,"T",null,3]
[4,null,"T",null,4]
[5,null,"T",null,5]
[6,null,"T",null,6]
[7,null,"T",null,7]
[8,null,"T",null,8]
[9,null,"T",null,9]
[10,null,"T",null,10]
[11,null,"T",null,11]
[12,null,"T",null,12]
[13,null,"T",null,13]
[14,null,"T",null,14]
[15,null,"T",null,15]
[16,null,"T",null,16]
[17,null,"T",null,17]
[18,null,"T",null,18]
[19,null,"T",null,19]
[20,null,"T",null,20]
[21,null,"T",null,21]
[22,null,"T",null,22]
[23,null,"T",null,23]
[24,null,"T",null,24]
[]
[null,null,"Copier/coller selon LISTE ENGAGES en fonction des équipes confirmées APRES les qualifications"]
[null,null,"ATTENTION : Respecter l'ordre des têtes de séries en fonction des points et classement de la LISTE ENGAGES"]
[null,null,{"$f":"CONCATENATE('EMARG M Tableau QUALIF'!C19,\" / \")","v":"T / "}]
[null,null,"EX: Si toutes les equipes du tableau principal sont confirmées, les équipes issues qualifications sont replacées en fonction de leurs points, en bas de tableau"]

{"sheet":"PLANNING PS 24 QUALIF","index":3,"n_rows":40,"n_cols":33,"rows_kept":40,"cut":false,"hidden":false,"merged":[[8,2,8,3],[8,21,8,22],[1,7,4,15],[1,16,7,17],[3,2,3,3],[3,21,3,22],[5,7,5,9],[5,10,5,13],[5,14,5,15],[6,7,6,15],[7,7,7,15]]}
[]
[null,null,null,null,null,null,null,{"$f":"IF('LISTE ENGAGES'!R3=\"\",'LISTE ENGAGES'!Q3,'LISTE ENGAGES'!R3)","v":"APPELATION TOURNOI"},null,null,null,null,null,null,null,null,{"$f":"IF('LISTE ENGAGES'!R10=\"\",'LISTE ENGAGES'!Q10,'LISTE ENGAGES'!R10)","v":"ORGANISATEUR"}]
[]
[null,"J1","HEURE DEBUT",null,"09:00:00",null,null,null,null,null,null,null,null,null,null,null,null,null,null,null,"J3","HEURE DEBUT",null,"17:20:00"]
[null,null,"DUREE MATCH",null,"00:35:00",null,null,null,null,null,null,null,null,null,null,null,null,null,null,null,null,"DUREE MATCH",null,"00:50:00"]
[null,null,null,null,null,null,null,{"$f":"IF('LISTE ENGAGES'!R4=\"\",'LISTE ENGAGES'!Q4,'LISTE ENGAGES'!R4)","v":"LIEU"},null,null,{"$f":"IF('LISTE ENGAGES'!R6=\"\",\"DATE\",CONCATENATE('LISTE ENGAGES'!R7,\"-\",'LISTE ENGAGES'!R8,\"/\",'LISTE ENGAGES'!R6))","v":"DATE"},null,null,null,{"$f":"IF('LISTE ENGAGES'!R9=\"\",'LISTE ENGAGES'!Q9,'LISTE ENGAGES'!R9)","v":"GENRE"}]
[null,null,null,null,null,null,null,{"$f":"IF('LISTE ENGAGES'!R5=\"\",'LISTE ENGAGES'!Q5,'LISTE ENGAGES'!R5)","v":"TYPE"}]
[null,null,null,null,null,null,null,"PLANNING DES RENCONTRES"]
[null,"J2","HEURE DEBUT",null,"09:00:00",null,null,null,null,null,null,null,null,null,null,null,null,null,null,null,"J4","HEURE DEBUT",null,"09:00:00"]
[null,null,"DUREE MATCH",null,"00:50:00",null,null,null,null,null,null,null,null,null,null,null,null,null,null,null,null,"DUREE MATCH",null,"01:00:00"]
[]
[]
[]
[]
[]
[null,null,null,null,"MATCH","n°","TER.","E1","./.","E2","ARB","MATCH","n°","TER.","E1","./.","E2","ARB","FORMAT","MATCH","n°","TER.","E1","./.","E2","ARB","MATCH","n°","TER.","E1","./.","E2","ARB"]
[null,null,"JOUR 1",{"$f":"E4","v":"09:00:00"},1,null,1,{"$f":"'TAB 24 P+B QUALIF'!C14","v":"T / 1"},null,{"$f":"'TAB 24 P+B QUALIF'!C17","v":"T / 24"},null,2,null,2,{"$f":"'TAB 24 P+B QUALIF'!C21","v":"T / 2"},null,{"$f":"'TAB 24 P+B QUALIF'!C24","v":"T / 23"},null,"2*15, SD 11",3,null,3,{"$f":"'TAB 24 P+B QUALIF'!C28","v":"T / 3"},null,{"$f":"'TAB 24 P+B QUALIF'!C31","v":"T / 22"}]
[null,null,null,{"$f":"D17+$E$5","v":"09:35:00"},4,null,1,{"$f":"'TAB 24 P+B QUALIF'!C35","v":"T / 4"},null,{"$f":"'TAB 24 P+B QUALIF'!C38","v":"T / 21"},null,5,null,2,{"$f":"'TAB 24 P+B QUALIF'!C42","v":"T / 5"},null,{"$f":"'TAB 24 P+B QUALIF'!C45","v":"T / 20"},null,"2*15, SD 11",6,null,3,{"$f":"'TAB 24 P+B QUALIF'!C49","v":"T / 6"},null,{"$f":"'TAB 24 P+B QUALIF'!C52","v":"T / 19"}]
[null,null,null,{"$f":"D18+$E$5","v":"10:10:00"},7,null,1,{"$f":"'TAB 24 P+B QUALIF'!C15","v":"T / 12"},null,{"$f":"'TAB 24 P+B QUALIF'!C16","v":"T / 13"},null,8,null,2,{"$f":"'TAB 24 P+B QUALIF'!C22","v":"T / 11"},null,{"$f":"'TAB 24 P+B QUALIF'!C23","v":"T / 14"},null,"2*15, SD 11",9,null,3,{"$f":"'TAB 24 P+B QUALIF'!C29","v":"T / 10"},null,{"$f":"'TAB 24 P+B QUALIF'!C30","v":"T / 15"}]
[null,null,null,"10:45:00",10,null,1,{"$f":"'TAB 24 P+B QUALIF'!C36","v":"T / 9"},null,{"$f":"'TAB 24 P+B QUALIF'!C37","v":"T / 16"},null,11,null,2,{"$f":"'TAB 24 P+B QUALIF'!C43","v":"T / 8"},null,{"$f":"'TAB 24 P+B QUALIF'!C44","v":"T / 17"},null,"2*15, SD 11",12,null,3,{"$f":"'TAB 24 P+B QUALIF'!C50","v":"T / 7"},null,{"$f":"'TAB 24 P+B QUALIF'!C51","v":"T / 18"}]
[null,null,null,"11:20:00",13,null,1,{"$f":"'TAB 24 P+B QUALIF'!C15","v":"T / 12"},null,{"$f":"'TAB 24 P+B QUALIF'!C17","v":"T / 24"},null,14,null,2,{"$f":"'TAB 24 P+B QUALIF'!C22","v":"T / 11"},null,{"$f":"'TAB 24 P+B QUALIF'!C24","v":"T / 23"},null,"2*15, SD 11",15,null,3,{"$f":"'TAB 24 P+B QUALIF'!C29","v":"T / 10"},null,{"$f":"'TAB 24 P+B QUALIF'!C31","v":"T / 22"}]
[null,null,null,"11:55:00",16,null,1,{"$f":"'TAB 24 P+B QUALIF'!C36","v":"T / 9"},null,{"$f":"'TAB 24 P+B QUALIF'!C38","v":"T / 21"},null,17,null,2,{"$f":"'TAB 24 P+B QUALIF'!C43","v":"T / 8"},null,{"$f":"'TAB 24 P+B QUALIF'!C45","v":"T / 20"},null,"2*15, SD 11",18,null,3,{"$f":"'TAB 24 P+B QUALIF'!C50","v":"T / 7"},null,{"$f":"'TAB 24 P+B QUALIF'!C52","v":"T / 19"}]
[null,null,null,"12:30:00",19,null,1,{"$f":"'TAB 24 P+B QUALIF'!C14","v":"T / 1"},null,{"$f":"'TAB 24 P+B QUALIF'!C16","v":"T / 13"},null,20,null,2,{"$f":"'TAB 24 P+B QUALIF'!C21","v":"T / 2"},null,{"$f":"'TAB 24 P+B QUALIF'!C23","v":"T / 14"},null,"2*15, SD 11",21,null,3,{"$f":"'TAB 24 P+B QUALIF'!C28","v":"T / 3"},null,{"$f":"'TAB 24 P+B QUALIF'!C30","v":"T / 15"}]
[null,null,null,"13:05:00",22,null,1,{"$f":"'TAB 24 P+B QUALIF'!C35","v":"T / 4"},null,{"$f":"'TAB 24 P+B QUALIF'!C37","v":"T / 16"},null,23,null,2,{"$f":"'TAB 24 P+B QUALIF'!C42","v":"T / 5"},null,{"$f":"'TAB 24 P+B QUALIF'!C44","v":"T / 17"},null,"2*15, SD 11",24,null,3,{"$f":"'TAB 24 P+B QUALIF'!C49","v":"T / 6"},null,{"$f":"'TAB 24 P+B QUALIF'!C51","v":"T / 18"}]
[null,null,null,"13:40:00",25,null,1,{"$f":"'TAB 24 P+B QUALIF'!C16","v":"T / 13"},null,{"$f":"'TAB 24 P+B QUALIF'!C17","v":"T / 24"},null,26,null,2,{"$f":"'TAB 24 P+B QUALIF'!C23","v":"T / 14"},null,{"$f":"'TAB 24 P+B QUALIF'!C24","v":"T / 23"},null,"2*15, SD 11",27,null,3,{"$f":"'TAB 24 P+B QUALIF'!C30","v":"T / 15"},null,{"$f":"'TAB 24 P+B QUALIF'!C31","v":"T / 22"}]
[null,null,null,"14:15:00",28,null,1,{"$f":"'TAB 24 P+B QUALIF'!C37","v":"T / 16"},null,{"$f":"'TAB 24 P+B QUALIF'!C38","v":"T / 21"},null,29,null,2,{"$f":"'TAB 24 P+B QUALIF'!C44","v":"T / 17"},null,{"$f":"'TAB 24 P+B QUALIF'!C45","v":"T / 20"},null,"2*15, SD 11",30,null,3,{"$f":"'TAB 24 P+B QUALIF'!C51","v":"T / 18"},null,{"$f":"'TAB 24 P+B QUALIF'!C52","v":"T / 19"}]
[null,null,null,"14:50:00",31,null,1,{"$f":"'TAB 24 P+B QUALIF'!C14","v":"T / 1"},null,{"$f":"'TAB 24 P+B QUALIF'!C15","v":"T / 12"},null,32,null,2,{"$f":"'TAB 24 P+B QUALIF'!C21","v":"T / 2"},null,{"$f":"'TAB 24 P+B QUALIF'!C22","v":"T / 11"},null,"2*15, SD 11",33,null,3,{"$f":"'TAB 24 P+B QUALIF'!C28","v":"T / 3"},null,{"$f":"'TAB 24 P+B QUALIF'!C29","v":"T / 10"}]
[null,null,null,"15:25:00",34,null,1,{"$f":"'TAB 24 P+B QUALIF'!C35","v":"T / 4"},null,{"$f":"'TAB 24 P+B QUALIF'!C36","v":"T / 9"},null,35,null,2,{"$f":"'TAB 24 P+B QUALIF'!C42","v":"T / 5"},null,{"$f":"'TAB 24 P+B QUALIF'!C43","v":"T / 8"},null,"2*15, SD 11",36,null,3,{"$f":"'TAB 24 P+B QUALIF'!C49","v":"T / 6"},null,{"$f":"'TAB 24 P+B QUALIF'!C50","v":"T / 7"}]
[null,null,null,"16:00:00",37,null,null,{"$f":"'TAB 24 P+B QUALIF'!K13","v":"2A"},null,{"$f":"'TAB 24 P+B QUALIF'!K16","v":"3 poule (B,C,D,E,F)"},null,38,null,null,{"$f":"'TAB 24 P+B QUALIF'!K21","v":"2B"},null,{"$f":"'TAB 24 P+B QUALIF'!K24","v":"3 poule (A,C,D,E,F)"},null,"2*15, SD 11"]
[null,null,null,"16:35:00",39,null,null,{"$f":"'TAB 24 P+B QUALIF'!K26","v":"2C"},null,{"$f":"'TAB 24 P+B QUALIF'!K29","v":"3 poule (A,B,D,E,F)"},null,40,null,null,{"$f":"'TAB 24 P+B QUALIF'!K34","v":"2D"},null,{"$f":"'TAB 24 P+B QUALIF'!K37","v":"3 poule (A,B,C,E,F)"},null,"2*15, SD 11"]
[null,null,null,"17:10:00",41,null,null,{"$f":"'TAB 24 P+B QUALIF'!K39","v":"2E"},null,{"$f":"'TAB 24 P+B QUALIF'!K42","v":"3 poule (A,B,C,D,F)"},null,42,null,null,{"$f":"'TAB 24 P+B QUALIF'!K47","v":"2F"},null,{"$f":"'TAB 24 P+B QUALIF'!K50","v":"3 poule (A,B,C,D,E)"},null,"2*15, SD 11"]
[null,null,null,{"$f":"D31+$E$10","v":"18:00:00"},null,null,null,null,null,null,null,null,null,null,null,null,null,null,"2*15, SD 11"]
[null,null,null,"18:50:00",null,null,null,null,null,null,null,null,null,null,null,null,null,null,"2*21, SD 15"]
[null,null,null,"19:40:00",null,null,null,null,null,null,null,null,null,null,null,null,null,null,"2*21, SD 15"]
[null,null,null,"20:30:00",null,null,null,null,null,null,null,null,null,null,null,null,null,null,"2*21, SD 15"]
[null,null,null,"21:20:00",null,null,null,null,null,null,null,null,null,null,null,null,null,null,"2*21, SD 15"]
[null,null,null,"22:10:00"]
[null,null,null,"23:00:00",null,null,null,null,null,null,null,null,null,null,null,null,null,null,"2*21, SD 15"]
[null,null,null,"23:50:00",null,null,null,null,null,null,null,null,null,null,null,null,null,null,"2*21, SD 15"]
[null,null,null,1.0277777777777781]

{"sheet":"SCORE 24 QUALIF","index":4,"n_rows":49,"n_cols":36,"rows_kept":49,"cut":false,"hidden":false,"merged":[]}
[null,null,null,null,null,"TABLEAU DE SAISIE DE RESULTATS"]
[]
["DEBUT J1","09:00:00",null,null,null,"Saisir le résultats des sets dans les cases bordurées et colorées uniquement"]
["TEMPS","00:30:00"]
["DEBUT J2","09:00:00"]
[]
[null,null,"PHASE","JOUR","N° MATCH","HEURE","TER","EQ1",null,"EQ2","SCORE EQ1",null,"SCORE EQ2","SET 1 EQ1","SET 1 EQ2","SET 2 EQ1","SET 2 EQ2","SET 3 EQ1","SET 3 EQ2","POS 1","POS 2",null,null,null,null,"PTS","S+","S-","P+","P-","CS","CP","CL.I","RG",null,"CLA"]
[null,null,"A",1,1,{"$f":"B3","v":"09:00:00"},1,{"$f":"'TAB 24 P+B QUALIF'!C14","v":"T / 1"},"/",{"$f":"'TAB 24 P+B QUALIF'!C17","v":"T / 24"},{"$f":"SUM(IF(N8>O8,1,0),IF(P8>Q8,1,0),IF(R8>S8,1,0))","v":0},"/",{"$f":"SUM(IF(O8>N8,1,0),IF(Q8>P8,1,0),IF(S8>R8,1,0))","v":0},null,null,null,null,null,null,{"$f":"IF(K8=M8,\"\",IF(K8>M8,H8,J8))","v":""},{"$f":"IF(K8=M8,\"\",IF(K8<M8,H8,J8))","v":""},null,null,null,{"$f":"'TAB 24 P+B QUALIF'!C14","v":"T / 1"},{"$f":"COUNTIF(PLACE1,Y8)*2+COUNTIF(PLACE2,Y8)","v":0},{"$f":"SUMIF(LISTEE1,Y8,(SCEQ1))+SUMIF(LISTEE2,Y8,(SCEQ2))","v":0},{"$f":"SUMIF(LISTEE1,Y8,(SCEQ2))+SUMIF(LISTEE2,Y8,(SCEQ1))","v":0},{"$f":"(SUMPRODUCT((LISTEE1=Y8)*((S1EQ1)+(S2EQ1)+(S3EQ1))))+(SUMPRODUCT((LISTEE2=Y8)*((S1EQ2)+(S2EQ2)+(S3EQ3))))","v":0},{"$f":"(SUMPRODUCT((LISTEE2=Y8)*((S1EQ1)+(S2EQ1)+(S3EQ1))))+(SUMPRODUCT((LISTEE1=Y8)*((S1EQ2)+(S2EQ2)+(S3EQ3))))","v":0},{"$f":"IFERROR(AA8/AB8,0)","v":0},{"$f":"IFERROR(AC8/AD8,0)","v":0},{"$f":"Z8+AE8/100+AF8/100","v":0},{"$f":"IF(Z8=0,\"\",RANK(AG8,$AG$8:$AG$11))","v":""},1,{"$f":"IF(Z8=0,\"\",IF($AH$8=AI8,$Y$8,IF($AH$9=AI8,$Y$9,IF($AH$10=AI8,$Y$10,IF($AH$11=AI8,$Y$11)))))","v":""}]
[null,null,"B",1,2,{"$f":"B3","v":"09:00:00"},2,{"$f":"'TAB 24 P+B QUALIF'!C21","v":"T / 2"},"/",{"$f":"'TAB 24 P+B QUALIF'!C24","v":"T / 23"},{"$f":"SUM(IF(N9>O9,1,0),IF(P9>Q9,1,0),IF(R9>S9,1,0))","v":0},"/",{"$f":"SUM(IF(O9>N9,1,0),IF(Q9>P9,1,0),IF(S9>R9,1,0))","v":0},null,null,null,null,null,null,{"$f":"IF(K9=M9,\"\",IF(K9>M9,H9,J9))","v":""},{"$f":"IF(K9=M9,\"\",IF(K9<M9,H9,J9))","v":""},null,null,null,{"$f":"'TAB 24 P+B QUALIF'!C15","v":"T / 12"},{"$f":"COUNTIF(PLACE1,Y9)*2+COUNTIF(PLACE2,Y9)","v":0},{"$f":"SUMIF(LISTEE1,Y9,(SCEQ1))+SUMIF(LISTEE2,Y9,(SCEQ2))","v":0},{"$f":"SUMIF(LISTEE1,Y9,(SCEQ2))+SUMIF(LISTEE2,Y9,(SCEQ1))","v":0},{"$f":"(SUMPRODUCT((LISTEE1=Y9)*((S1EQ1)+(S2EQ1)+(S3EQ1))))+(SUMPRODUCT((LISTEE2=Y9)*((S1EQ2)+(S2EQ2)+(S3EQ3))))","v":0},{"$f":"(SUMPRODUCT((LISTEE2=Y9)*((S1EQ1)+(S2EQ1)+(S3EQ1))))+(SUMPRODUCT((LISTEE1=Y9)*((S1EQ2)+(S2EQ2)+(S3EQ3))))","v":0},{"$f":"IFERROR(AA9/AB9,0)","v":0},{"$f":"IFERROR(AC9/AD9,0)","v":0},{"$f":"Z9+AE9/100+AF9/100","v":0},{"$f":"IF(Z9=0,\"\",RANK(AG9,$AG$8:$AG$11))","v":""},2,{"$f":"IF(Z9=0,\"\",IF($AH$8=AI9,$Y$8,IF($AH$9=AI9,$Y$9,IF($AH$10=AI9,$Y$10,IF($AH$11=AI9,$Y$11)))))","v":""}]
[null,null,"C",1,3,{"$f":"F8+$B$4","v":"09:30:00"},1,{"$f":"'TAB 24 P+B QUALIF'!C28","v":"T / 3"},"/",{"$f":"'TAB 24 P+B QUALIF'!C31","v":"T / 22"},0,"/",0,null,null,null,null,null,null,"","",null,null,null,{"$f":"'TAB 24 P+B QUALIF'!C16","v":"T / 13"},{"$f":"COUNTIF(PLACE1,Y10)*2+COUNTIF(PLACE2,Y10)","v":0},{"$f":"SUMIF(LISTEE1,Y10,(SCEQ1))+SUMIF(LISTEE2,Y10,(SCEQ2))","v":0},{"$f":"SUMIF(LISTEE1,Y10,SCEQ2)+SUMIF(LISTEE2,Y10,SCEQ1)","v":0},{"$f":"(SUMPRODUCT((LISTEE1=Y10)*((S1EQ1)+(S2EQ1)+(S3EQ1))))+(SUMPRODUCT((LISTEE2=Y10)*((S1EQ2)+(S2EQ2)+(S3EQ3))))","v":0},{"$f":"(SUMPRODUCT((LISTEE2=Y10)*((S1EQ1)+(S2EQ1)+(S3EQ1))))+(SUMPRODUCT((LISTEE1=Y10)*((S1EQ2)+(S2EQ2)+(S3EQ3))))","v":0},0,0,0,{"$f":"IF(Z10=0,\"\",RANK(AG10,$AG$8:$AG$11))","v":""},3,{"$f":"IF(Z10=0,\"\",IF($AH$8=AI10,$Y$8,IF($AH$9=AI10,$Y$9,IF($AH$10=AI10,$Y$10,IF($AH$11=AI10,$Y$11)))))","v":""}]
[null,null,"D",1,4,"09:30:00",2,{"$f":"'TAB 24 P+B QUALIF'!C35","v":"T / 4"},"/",{"$f":"'TAB 24 P+B QUALIF'!C38","v":"T / 21"},0,"/",0,null,null,null,null,null,null,"","",null,null,null,{"$f":"'TAB 24 P+B QUALIF'!C17","v":"T / 24"},{"$f":"COUNTIF(PLACE1,Y11)*2+COUNTIF(PLACE2,Y11)","v":0},{"$f":"SUMIF(LISTEE1,Y11,(SCEQ1))+SUMIF(LISTEE2,Y11,(SCEQ2))","v":0},{"$f":"SUMIF(LISTEE1,Y11,SCEQ2)+SUMIF(LISTEE2,Y11,SCEQ1)","v":0},{"$f":"(SUMPRODUCT((LISTEE1=Y11)*((S1EQ1)+(S2EQ1)+(S3EQ1))))+(SUMPRODUCT((LISTEE2=Y11)*((S1EQ2)+(S2EQ2)+(S3EQ3))))","v":0},{"$f":"(SUMPRODUCT((LISTEE2=Y11)*((S1EQ1)+(S2EQ1)+(S3EQ1))))+(SUMPRODUCT((LISTEE1=Y11)*((S1EQ2)+(S2EQ2)+(S3EQ3))))","v":0},0,0,0,{"$f":"IF(Z11=0,\"\",RANK(AG11,$AG$8:$AG$11))","v":""},4,{"$f":"IF(Z11=0,\"\",IF($AH$8=AI11,$Y$8,IF($AH$9=AI11,$Y$9,IF($AH$10=AI11,$Y$10,IF($AH$11=AI11,$Y$11)))))","v":""}]
[null,null,"E",1,5,"10:00:00",1,{"$f":"'TAB 24 P+B QUALIF'!C42","v":"T / 5"},"/",{"$f":"'TAB 24 P+B QUALIF'!C45","v":"T / 20"},0,"/",0,null,null,null,null,null,null,"",""]
[null,null,"F",1,6,"10:00:00",2,{"$f":"'TAB 24 P+B QUALIF'!C49","v":"T / 6"},"/",{"$f":"'TAB 24 P+B QUALIF'!C52","v":"T / 19"},0,"/",0,null,null,null,null,null,null,"","",null,null,null,{"$f":"'TAB 24 P+B QUALIF'!C21","v":"T / 2"},{"$f":"COUNTIF(PLACE1,Y13)*2+COUNTIF(PLACE2,Y13)","v":0},{"$f":"SUMIF(LISTEE1,Y13,(SCEQ1))+SUMIF(LISTEE2,Y13,(SCEQ2))","v":0},{"$f":"SUMIF(LISTEE1,Y13,SCEQ2)+SUMIF(LISTEE2,Y13,SCEQ1)","v":0},{"$f":"(SUMPRODUCT((LISTEE1=Y13)*((S1EQ1)+(S2EQ1)+(S3EQ1))))+(SUMPRODUCT((LISTEE2=Y13)*((S1EQ2)+(S2EQ2)+(S3EQ3))))","v":0},{"$f":"(SUMPRODUCT((LISTEE2=Y13)*((S1EQ1)+(S2EQ1)+(S3EQ1))))+(SUMPRODUCT((LISTEE1=Y13)*((S1EQ2)+(S2EQ2)+(S3EQ3))))","v":0},0,0,0,{"$f":"IF(Z13=0,\"\",RANK(AG13,$AG$13:$AG$16))","v":""},1,{"$f":"IF(Z13=0,\"\",IF($AH$13=AI13,$Y$13,IF($AH$14=AI13,$Y$14,IF($AH$15=AI13,$Y$15,IF($AH$16=AI13,$Y$16)))))","v":""}]
[null,null,"A",1,7,"10:30:00",1,{"$f":"'TAB 24 P+B QUALIF'!C15","v":"T / 12"},"/",{"$f":"'TAB 24 P+B QUALIF'!C16","v":"T / 13"},{"$f":"SUM(IF(N14>O14,1,0),IF(P14>Q14,1,0),IF(R14>S14,1,0))","v":0},"/",0,null,null,null,null,null,null,{"$f":"IF(K14=M14,\"\",IF(K14>M14,H14,J14))","v":""},"",null,null,null,{"$f":"'TAB 24 P+B QUALIF'!C22","v":"T / 11"},{"$f":"COUNTIF(PLACE1,Y14)*2+COUNTIF(PLACE2,Y14)","v":0},{"$f":"SUMIF(LISTEE1,Y14,(SCEQ1))+SUMIF(LISTEE2,Y14,(SCEQ2))","v":0},{"$f":"SUMIF(LISTEE1,Y14,SCEQ2)+SUMIF(LISTEE2,Y14,SCEQ1)","v":0},{"$f":"(SUMPRODUCT((LISTEE1=Y14)*((S1EQ1)+(S2EQ1)+(S3EQ1))))+(SUMPRODUCT((LISTEE2=Y14)*((S1EQ2)+(S2EQ2)+(S3EQ3))))","v":0},{"$f":"(SUMPRODUCT((LISTEE2=Y14)*((S1EQ1)+(S2EQ1)+(S3EQ1))))+(SUMPRODUCT((LISTEE1=Y14)*((S1EQ2)+(S2EQ2)+(S3EQ3))))","v":0},0,0,0,{"$f":"IF(Z14=0,\"\",RANK(AG14,$AG$13:$AG$16))","v":""},2,{"$f":"IF(Z14=0,\"\",IF($AH$13=AI14,$Y$13,IF($AH$14=AI14,$Y$14,IF($AH$15=AI14,$Y$15,IF($AH$16=AI14,$Y$16)))))","v":""}]
[null,null,"B",1,8,"10:30:00",2,{"$f":"'TAB 24 P+B QUALIF'!C22","v":"T / 11"},"/",{"$f":"'TAB 24 P+B QUALIF'!C23","v":"T / 14"},0,"/",0,null,null,null,null,null,null,"","",null,null,null,{"$f":"'TAB 24 P+B QUALIF'!C23","v":"T / 14"},{"$f":"COUNTIF(PLACE1,Y15)*2+COUNTIF(PLACE2,Y15)","v":0},{"$f":"SUMIF(LISTEE1,Y15,(SCEQ1))+SUMIF(LISTEE2,Y15,(SCEQ2))","v":0},{"$f":"SUMIF(LISTEE1,Y15,SCEQ2)+SUMIF(LISTEE2,Y15,SCEQ1)","v":0},{"$f":"(SUMPRODUCT((LISTEE1=Y15)*((S1EQ1)+(S2EQ1)+(S3EQ1))))+(SUMPRODUCT((LISTEE2=Y15)*((S1EQ2)+(S2EQ2)+(S3EQ3))))","v":0},{"$f":"(SUMPRODUCT((LISTEE2=Y15)*((S1EQ1)+(S2EQ1)+(S3EQ1))))+(SUMPRODUCT((LISTEE1=Y15)*((S1EQ2)+(S2EQ2)+(S3EQ3))))","v":0},0,0,0,{"$f":"IF(Z15=0,\"\",RANK(AG15,$AG$13:$AG$16))","v":""},3,{"$f":"IF(Z15=0,\"\",IF($AH$13=AI15,$Y$13,IF($AH$14=AI15,$Y$14,IF($AH$15=AI15,$Y$15,IF($AH$16=AI15,$Y$16)))))","v":""}]
[null,null,"C",1,9,"11:00:00",1,{"$f":"'TAB 24 P+B QUALIF'!C29","v":"T / 10"},"/",{"$f":"'TAB 24 P+B QUALIF'!C30","v":"T / 15"},0,"/",0,null,null,null,null,null,null,"","",null,null,null,{"$f":"'TAB 24 P+B QUALIF'!C24","v":"T / 23"},{"$f":"COUNTIF(PLACE1,Y16)*2+COUNTIF(PLACE2,Y16)","v":0},{"$f":"SUMIF(LISTEE1,Y16,(SCEQ1))+SUMIF(LISTEE2,Y16,(SCEQ2))","v":0},{"$f":"SUMIF(LISTEE1,Y16,SCEQ2)+SUMIF(LISTEE2,Y16,SCEQ1)","v":0},{"$f":"(SUMPRODUCT((LISTEE1=Y16)*((S1EQ1)+(S2EQ1)+(S3EQ1))))+(SUMPRODUCT((LISTEE2=Y16)*((S1EQ2)+(S2EQ2)+(S3EQ3))))","v":0},{"$f":"(SUMPRODUCT((LISTEE2=Y16)*((S1EQ1)+(S2EQ1)+(S3EQ1))))+(SUMPRODUCT((LISTEE1=Y16)*((S1EQ2)+(S2EQ2)+(S3EQ3))))","v":0},0,0,0,{"$f":"IF(Z16=0,\"\",RANK(AG16,$AG$13:$AG$16))","v":""},4,{"$f":"IF(Z16=0,\"\",IF($AH$13=AI16,$Y$13,IF($AH$14=AI16,$Y$14,IF($AH$15=AI16,$Y$15,IF($AH$16=AI16,$Y$16)))))","v":""}]
[null,null,"D",1,10,"11:00:00",2,{"$f":"'TAB 24 P+B QUALIF'!C36","v":"T / 9"},"/",{"$f":"'TAB 24 P+B QUALIF'!C37","v":"T / 16"},0,"/",0,null,null,null,null,null,null,"",""]
[null,null,"E",1,11,"11:30:00",1,{"$f":"'TAB 24 P+B QUALIF'!C43","v":"T / 8"},"/",{"$f":"'TAB 24 P+B QUALIF'!C44","v":"T / 17"},0,"/",0,null,null,null,null,null,null,"","",null,null,null,{"$f":"'TAB 24 P+B QUALIF'!C28","v":"T / 3"},{"$f":"COUNTIF(PLACE1,Y18)*2+COUNTIF(PLACE2,Y18)","v":0},{"$f":"SUMIF(LISTEE1,Y18,(SCEQ1))+SUMIF(LISTEE2,Y18,(SCEQ2))","v":0},{"$f":"SUMIF(LISTEE1,Y18,SCEQ2)+SUMIF(LISTEE2,Y18,SCEQ1)","v":0},{"$f":"(SUMPRODUCT((LISTEE1=Y18)*((S1EQ1)+(S2EQ1)+(S3EQ1))))+(SUMPRODUCT((LISTEE2=Y18)*((S1EQ2)+(S2EQ2)+(S3EQ3))))","v":0},{"$f":"(SUMPRODUCT((LISTEE2=Y18)*((S1EQ1)+(S2EQ1)+(S3EQ1))))+(SUMPRODUCT((LISTEE1=Y18)*((S1EQ2)+(S2EQ2)+(S3EQ3))))","v":0},{"$f":"IFERROR(AA18/AB18,0)","v":0},0,{"$f":"Z18+AE18/100+AF18/100","v":0},{"$f":"IF(Z18=0,\"\",RANK(AG18,$AG$18:$AG$21))","v":""},1,{"$f":"IF(Z18=0,\"\",IF($AH$18=AI18,$Y$18,IF($AH$19=AI18,$Y$19,IF($AH$20=AI18,$Y$20,IF($AH$21=AI18,$Y$21)))))","v":""}]
[null,null,"F",1,12,"11:30:00",2,{"$f":"'TAB 24 P+B QUALIF'!C50","v":"T / 7"},"/",{"$f":"'TAB 24 P+B QUALIF'!C51","v":"T / 18"},0,"/",0,null,null,null,null,null,null,"","",null,null,null,{"$f":"'TAB 24 P+B QUALIF'!C29","v":"T / 10"},{"$f":"COUNTIF(PLACE1,Y19)*2+COUNTIF(PLACE2,Y19)","v":0},{"$f":"SUMIF(LISTEE1,Y19,(SCEQ1))+SUMIF(LISTEE2,Y19,(SCEQ2))","v":0},{"$f":"SUMIF(LISTEE1,Y19,SCEQ2)+SUMIF(LISTEE2,Y19,SCEQ1)","v":0},{"$f":"(SUMPRODUCT((LISTEE1=Y19)*((S1EQ1)+(S2EQ1)+(S3EQ1))))+(SUMPRODUCT((LISTEE2=Y19)*((S1EQ2)+(S2EQ2)+(S3EQ3))))","v":0},{"$f":"(SUMPRODUCT((LISTEE2=Y19)*((S1EQ1)+(S2EQ1)+(S3EQ1))))+(SUMPRODUCT((LISTEE1=Y19)*((S1EQ2)+(S2EQ2)+(S3EQ3))))","v":0},0,0,{"$f":"Z19+AE19/100+AF19/100","v":0},{"$f":"IF(Z19=0,\"\",RANK(AG19,$AG$18:$AG$21))","v":""},2,{"$f":"IF(Z19=0,\"\",IF($AH$18=AI19,$Y$18,IF($AH$19=AI19,$Y$19,IF($AH$20=AI19,$Y$20,IF($AH$21=AI19,$Y$21)))))","v":""}]
[null,null,"A",1,13,"12:00:00",1,{"$f":"'TAB 24 P+B QUALIF'!C15","v":"T / 12"},"/",{"$f":"'TAB 24 P+B QUALIF'!C17","v":"T / 24"},0,"/",0,null,null,null,null,null,null,"","",null,null,null,{"$f":"'TAB 24 P+B QUALIF'!C30","v":"T / 15"},{"$f":"COUNTIF(PLACE1,Y20)*2+COUNTIF(PLACE2,Y20)","v":0},{"$f":"SUMIF(LISTEE1,Y20,(SCEQ1))+SUMIF(LISTEE2,Y20,(SCEQ2))","v":0},{"$f":"SUMIF(LISTEE1,Y20,SCEQ2)+SUMIF(LISTEE2,Y20,SCEQ1)","v":0},{"$f":"(SUMPRODUCT((LISTEE1=Y20)*((S1EQ1)+(S2EQ1)+(S3EQ1))))+(SUMPRODUCT((LISTEE2=Y20)*((S1EQ2)+(S2EQ2)+(S3EQ3))))","v":0},{"$f":"(SUMPRODUCT((LISTEE2=Y20)*((S1EQ1)+(S2EQ1)+(S3EQ1))))+(SUMPRODUCT((LISTEE1=Y20)*((S1EQ2)+(S2EQ2)+(S3EQ3))))","v":0},0,0,0,"",3,{"$f":"IF(Z20=0,\"\",IF($AH$18=AI20,$Y$18,IF($AH$19=AI20,$Y$19,IF($AH$20=AI20,$Y$20,IF($AH$21=AI20,$Y$21)))))","v":""}]
[null,null,"B",1,14,"12:00:00",2,{"$f":"'TAB 24 P+B QUALIF'!C22","v":"T / 11"},"/",{"$f":"'TAB 24 P+B QUALIF'!C24","v":"T / 23"},0,"/",0,null,null,null,null,null,null,"","",null,null,null,{"$f":"'TAB 24 P+B QUALIF'!C31","v":"T / 22"},{"$f":"COUNTIF(PLACE1,Y21)*2+COUNTIF(PLACE2,Y21)","v":0},{"$f":"SUMIF(LISTEE1,Y21,(SCEQ1))+SUMIF(LISTEE2,Y21,(SCEQ2))","v":0},{"$f":"SUMIF(LISTEE1,Y21,SCEQ2)+SUMIF(LISTEE2,Y21,SCEQ1)","v":0},{"$f":"(SUMPRODUCT((LISTEE1=Y21)*((S1EQ1)+(S2EQ1)+(S3EQ1))))+(SUMPRODUCT((LISTEE2=Y21)*((S1EQ2)+(S2EQ2)+(S3EQ3))))","v":0},{"$f":"(SUMPRODUCT((LISTEE2=Y21)*((S1EQ1)+(S2EQ1)+(S3EQ1))))+(SUMPRODUCT((LISTEE1=Y21)*((S1EQ2)+(S2EQ2)+(S3EQ3))))","v":0},0,0,{"$f":"Z21+AE21/100+AF21/100","v":0},"",4,{"$f":"IF(Z21=0,\"\",IF($AH$18=AI21,$Y$18,IF($AH$19=AI21,$Y$19,IF($AH$20=AI21,$Y$20,IF($AH$21=AI21,$Y$21)))))","v":""}]
[null,null,"C",1,15,"12:30:00",1,{"$f":"'TAB 24 P+B QUALIF'!C29","v":"T / 10"},"/",{"$f":"'TAB 24 P+B QUALIF'!C31","v":"T / 22"},0,"/",0,null,null,null,null,null,null,"",""]
[null,null,"D",1,16,"12:30:00",2,{"$f":"'TAB 24 P+B QUALIF'!C36","v":"T / 9"},"/",{"$f":"'TAB 24 P+B QUALIF'!C38","v":"T / 21"},0,"/",0,null,null,null,null,null,null,"","",null,null,null,{"$f":"'TAB 24 P+B QUALIF'!C35","v":"T / 4"},{"$f":"COUNTIF(PLACE1,Y23)*2+COUNTIF(PLACE2,Y23)","v":0},{"$f":"SUMIF(LISTEE1,Y23,(SCEQ1))+SUMIF(LISTEE2,Y23,(SCEQ2))","v":0},{"$f":"SUMIF(LISTEE1,Y23,SCEQ2)+SUMIF(LISTEE2,Y23,SCEQ1)","v":0},{"$f":"(SUMPRODUCT((LISTEE1=Y23)*((S1EQ1)+(S2EQ1)+(S3EQ1))))+(SUMPRODUCT((LISTEE2=Y23)*((S1EQ2)+(S2EQ2)+(S3EQ3))))","v":0},{"$f":"(SUMPRODUCT((LISTEE2=Y23)*((S1EQ1)+(S2EQ1)+(S3EQ1))))+(SUMPRODUCT((LISTEE1=Y23)*((S1EQ2)+(S2EQ2)+(S3EQ3))))","v":0},0,0,0,{"$f":"IF(Z23=0,\"\",RANK(AG23,$AG$23:$AG$26))","v":""},1,{"$f":"IF(Z23=0,\"\",IF($AH$23=AI23,$Y$23,IF($AH$24=AI23,$Y$24,IF($AH$25=AI23,$Y$25,IF($AH$26=AI23,$Y$26)))))","v":""}]
[null,null,"E",1,17,"13:00:00",1,{"$f":"'TAB 24 P+B QUALIF'!C43","v":"T / 8"},"/",{"$f":"'TAB 24 P+B QUALIF'!C45","v":"T / 20"},0,"/",0,null,null,null,null,null,null,"","",null,null,null,{"$f":"'TAB 24 P+B QUALIF'!C36","v":"T / 9"},{"$f":"COUNTIF(PLACE1,Y24)*2+COUNTIF(PLACE2,Y24)","v":0},{"$f":"SUMIF(LISTEE1,Y24,(SCEQ1))+SUMIF(LISTEE2,Y24,(SCEQ2))","v":0},{"$f":"SUMIF(LISTEE1,Y24,SCEQ2)+SUMIF(LISTEE2,Y24,SCEQ1)","v":0},{"$f":"(SUMPRODUCT((LISTEE1=Y24)*((S1EQ1)+(S2EQ1)+(S3EQ1))))+(SUMPRODUCT((LISTEE2=Y24)*((S1EQ2)+(S2EQ2)+(S3EQ3))))","v":0},{"$f":"(SUMPRODUCT((LISTEE2=Y24)*((S1EQ1)+(S2EQ1)+(S3EQ1))))+(SUMPRODUCT((LISTEE1=Y24)*((S1EQ2)+(S2EQ2)+(S3EQ3))))","v":0},0,0,0,{"$f":"IF(Z24=0,\"\",RANK(AG24,$AG$23:$AG$26))","v":""},2,{"$f":"IF(Z24=0,\"\",IF($AH$23=AI24,$Y$23,IF($AH$24=AI24,$Y$24,IF($AH$25=AI24,$Y$25,IF($AH$26=AI24,$Y$26)))))","v":""}]
[null,null,"F",1,18,"13:00:00",2,{"$f":"'TAB 24 P+B QUALIF'!C50","v":"T / 7"},"/",{"$f":"'TAB 24 P+B QUALIF'!C52","v":"T / 19"},0,"/",0,null,null,null,null,null,null,"","",null,null,null,{"$f":"'TAB 24 P+B QUALIF'!C37","v":"T / 16"},{"$f":"COUNTIF(PLACE1,Y25)*2+COUNTIF(PLACE2,Y25)","v":0},{"$f":"SUMIF(LISTEE1,Y25,(SCEQ1))+SUMIF(LISTEE2,Y25,(SCEQ2))","v":0},{"$f":"SUMIF(LISTEE1,Y25,SCEQ2)+SUMIF(LISTEE2,Y25,SCEQ1)","v":0},{"$f":"(SUMPRODUCT((LISTEE1=Y25)*((S1EQ1)+(S2EQ1)+(S3EQ1))))+(SUMPRODUCT((LISTEE2=Y25)*((S1EQ2)+(S2EQ2)+(S3EQ3))))","v":0},{"$f":"(SUMPRODUCT((LISTEE2=Y25)*((S1EQ1)+(S2EQ1)+(S3EQ1))))+(SUMPRODUCT((LISTEE1=Y25)*((S1EQ2)+(S2EQ2)+(S3EQ3))))","v":0},0,0,0,"",3,""]
[null,null,"A",1,19,"13:30:00",1,{"$f":"'TAB 24 P+B QUALIF'!C14","v":"T / 1"},"/",{"$f":"'TAB 24 P+B QUALIF'!C16","v":"T / 13"},0,"/",0,null,null,null,null,null,null,"","",null,null,null,{"$f":"'TAB 24 P+B QUALIF'!C38","v":"T / 21"},{"$f":"COUNTIF(PLACE1,Y26)*2+COUNTIF(PLACE2,Y26)","v":0},{"$f":"SUMIF(LISTEE1,Y26,(SCEQ1))+SUMIF(LISTEE2,Y26,(SCEQ2))","v":0},{"$f":"SUMIF(LISTEE1,Y26,SCEQ2)+SUMIF(LISTEE2,Y26,SCEQ1)","v":0},{"$f":"(SUMPRODUCT((LISTEE1=Y26)*((S1EQ1)+(S2EQ1)+(S3EQ1))))+(SUMPRODUCT((LISTEE2=Y26)*((S1EQ2)+(S2EQ2)+(S3EQ3))))","v":0},{"$f":"(SUMPRODUCT((LISTEE2=Y26)*((S1EQ1)+(S2EQ1)+(S3EQ1))))+(SUMPRODUCT((LISTEE1=Y26)*((S1EQ2)+(S2EQ2)+(S3EQ3))))","v":0},0,0,0,"",4,{"$f":"IF(Z26=0,\"\",IF($AH$23=AI26,$Y$23,IF($AH$24=AI26,$Y$24,IF($AH$25=AI26,$Y$25,IF($AH$26=AI26,$Y$26)))))","v":""}]
[null,null,"B",1,20,"13:30:00",2,{"$f":"'TAB 24 P+B QUALIF'!C21","v":"T / 2"},"/",{"$f":"'TAB 24 P+B QUALIF'!C23","v":"T / 14"},0,"/",0,null,null,null,null,null,null,"",""]
[null,null,"C",1,21,"14:00:00",1,{"$f":"'TAB 24 P+B QUALIF'!C28","v":"T / 3"},"/",{"$f":"'TAB 24 P+B QUALIF'!C30","v":"T / 15"},0,"/",0,null,null,null,null,null,null,"","",null,null,null,{"$f":"'TAB 24 P+B QUALIF'!C42","v":"T / 5"},{"$f":"COUNTIF(PLACE1,Y28)*2+COUNTIF(PLACE2,Y28)","v":0},{"$f":"SUMIF(LISTEE1,Y28,(SCEQ1))+SUMIF(LISTEE2,Y28,(SCEQ2))","v":0},{"$f":"SUMIF(LISTEE1,Y28,SCEQ2)+SUMIF(LISTEE2,Y28,SCEQ1)","v":0},{"$f":"(SUMPRODUCT((LISTEE1=Y28)*((S1EQ1)+(S2EQ1)+(S3EQ1))))+(SUMPRODUCT((LISTEE2=Y28)*((S1EQ2)+(S2EQ2)+(S3EQ3))))","v":0},{"$f":"(SUMPRODUCT((LISTEE2=Y28)*((S1EQ1)+(S2EQ1)+(S3EQ1))))+(SUMPRODUCT((LISTEE1=Y28)*((S1EQ2)+(S2EQ2)+(S3EQ3))))","v":0},{"$f":"IFERROR(AA28/AB28,0)","v":0},0,{"$f":"Z28+AE28/100+AF28/100","v":0},{"$f":"IF(Z28=0,\"\",RANK(AG28,$AG$28:$AG$31))","v":""},1,{"$f":"IF(Z28=0,\"\",IF($AH$28=AI28,$Y$28,IF($AH$29=AI28,$Y$29,IF($AH$30=AI28,$Y$30,IF($AH$31=AI28,$Y$31)))))","v":""}]
[null,null,"D",1,22,"14:00:00",2,{"$f":"'TAB 24 P+B QUALIF'!C35","v":"T / 4"},"/",{"$f":"'TAB 24 P+B QUALIF'!C37","v":"T / 16"},0,"/",0,null,null,null,null,null,null,"","",null,null,null,{"$f":"'TAB 24 P+B QUALIF'!C43","v":"T / 8"},{"$f":"COUNTIF(PLACE1,Y29)*2+COUNTIF(PLACE2,Y29)","v":0},{"$f":"SUMIF(LISTEE1,Y29,(SCEQ1))+SUMIF(LISTEE2,Y29,(SCEQ2))","v":0},{"$f":"SUMIF(LISTEE1,Y29,SCEQ2)+SUMIF(LISTEE2,Y29,SCEQ1)","v":0},{"$f":"(SUMPRODUCT((LISTEE1=Y29)*((S1EQ1)+(S2EQ1)+(S3EQ1))))+(SUMPRODUCT((LISTEE2=Y29)*((S1EQ2)+(S2EQ2)+(S3EQ3))))","v":0},{"$f":"(SUMPRODUCT((LISTEE2=Y29)*((S1EQ1)+(S2EQ1)+(S3EQ1))))+(SUMPRODUCT((LISTEE1=Y29)*((S1EQ2)+(S2EQ2)+(S3EQ3))))","v":0},{"$f":"IFERROR(AA29/AB29,0)","v":0},0,{"$f":"Z29+AE29/100+AF29/100","v":0},{"$f":"IF(Z29=0,\"\",RANK(AG29,$AG$28:$AG$31))","v":""},2,{"$f":"IF(Z29=0,\"\",IF($AH$28=AI29,$Y$28,IF($AH$29=AI29,$Y$29,IF($AH$30=AI29,$Y$30,IF($AH$31=AI29,$Y$31)))))","v":""}]
[null,null,"E",1,23,"14:30:00",1,{"$f":"'TAB 24 P+B QUALIF'!C42","v":"T / 5"},"/",{"$f":"'TAB 24 P+B QUALIF'!C44","v":"T / 17"},0,"/",0,null,null,null,null,null,null,"","",null,null,null,{"$f":"'TAB 24 P+B QUALIF'!C44","v":"T / 17"},{"$f":"COUNTIF(PLACE1,Y30)*2+COUNTIF(PLACE2,Y30)","v":0},{"$f":"SUMIF(LISTEE1,Y30,(SCEQ1))+SUMIF(LISTEE2,Y30,(SCEQ2))","v":0},{"$f":"SUMIF(LISTEE1,Y30,SCEQ2)+SUMIF(LISTEE2,Y30,SCEQ1)","v":0},{"$f":"(SUMPRODUCT((LISTEE1=Y30)*((S1EQ1)+(S2EQ1)+(S3EQ1))))+(SUMPRODUCT((LISTEE2=Y30)*((S1EQ2)+(S2EQ2)+(S3EQ3))))","v":0},{"$f":"(SUMPRODUCT((LISTEE2=Y30)*((S1EQ1)+(S2EQ1)+(S3EQ1))))+(SUMPRODUCT((LISTEE1=Y30)*((S1EQ2)+(S2EQ2)+(S3EQ3))))","v":0},0,0,0,"",3,{"$f":"IF(Z30=0,\"\",IF($AH$28=AI30,$Y$28,IF($AH$29=AI30,$Y$29,IF($AH$30=AI30,$Y$30,IF($AH$31=AI30,$Y$31)))))","v":""}]
[null,null,"F",1,24,"14:30:00",2,{"$f":"'TAB 24 P+B QUALIF'!C49","v":"T / 6"},"/",{"$f":"'TAB 24 P+B QUALIF'!C51","v":"T / 18"},0,"/",0,null,null,null,null,null,null,{"$f":"IF(K31=M31,\"\",IF(K31>M31,H31,J31))","v":""},"",null,null,null,{"$f":"'TAB 24 P+B QUALIF'!C45","v":"T / 20"},{"$f":"COUNTIF(PLACE1,Y31)*2+COUNTIF(PLACE2,Y31)","v":0},{"$f":"SUMIF(LISTEE1,Y31,(SCEQ1))+SUMIF(LISTEE2,Y31,(SCEQ2))","v":0},{"$f":"SUMIF(LISTEE1,Y31,SCEQ2)+SUMIF(LISTEE2,Y31,SCEQ1)","v":0},{"$f":"(SUMPRODUCT((LISTEE1=Y31)*((S1EQ1)+(S2EQ1)+(S3EQ1))))+(SUMPRODUCT((LISTEE2=Y31)*((S1EQ2)+(S2EQ2)+(S3EQ3))))","v":0},{"$f":"(SUMPRODUCT((LISTEE2=Y31)*((S1EQ1)+(S2EQ1)+(S3EQ1))))+(SUMPRODUCT((LISTEE1=Y31)*((S1EQ2)+(S2EQ2)+(S3EQ3))))","v":0},0,0,0,"",4,{"$f":"IF(Z31=0,\"\",IF($AH$28=AI31,$Y$28,IF($AH$29=AI31,$Y$29,IF($AH$30=AI31,$Y$30,IF($AH$31=AI31,$Y$31)))))","v":""}]
[null,null,"A",1,25,"15:00:00",1,{"$f":"'TAB 24 P+B QUALIF'!C16","v":"T / 13"},"/",{"$f":"'TAB 24 P+B QUALIF'!C17","v":"T / 24"},0,"/",0,null,null,null,null,null,null,{"$f":"IF(K32=M32,\"\",IF(K32>M32,H32,J32))","v":""},""]
[null,null,"B",1,26,"15:00:00",2,{"$f":"'TAB 24 P+B QUALIF'!C23","v":"T / 14"},"/",{"$f":"'TAB 24 P+B QUALIF'!C24","v":"T / 23"},0,"/",0,null,null,null,null,null,null,{"$f":"IF(K33=M33,\"\",IF(K33>M33,H33,J33))","v":""},"",null,null,null,{"$f":"'TAB 24 P+B QUALIF'!C49","v":"T / 6"},{"$f":"COUNTIF(PLACE1,Y33)*2+COUNTIF(PLACE2,Y33)","v":0},{"$f":"SUMIF(LISTEE1,Y33,(SCEQ1))+SUMIF(LISTEE2,Y33,(SCEQ2))","v":0},{"$f":"SUMIF(LISTEE1,Y33,SCEQ2)+SUMIF(LISTEE2,Y33,SCEQ1)","v":0},{"$f":"(SUMPRODUCT((LISTEE1=Y33)*((S1EQ1)+(S2EQ1)+(S3EQ1))))+(SUMPRODUCT((LISTEE2=Y33)*((S1EQ2)+(S2EQ2)+(S3EQ3))))","v":0},{"$f":"(SUMPRODUCT((LISTEE2=Y33)*((S1EQ1)+(S2EQ1)+(S3EQ1))))+(SUMPRODUCT((LISTEE1=Y33)*((S1EQ2)+(S2EQ2)+(S3EQ3))))","v":0},{"$f":"IFERROR(AA33/AB33,0)","v":0},0,{"$f":"Z33+AE33/100+AF33/100","v":0},{"$f":"IF(Z33=0,\"\",RANK(AG33,$AG$33:$AG$36))","v":""},1,{"$f":"IF(Z33=0,\"\",IF($AH$33=AI33,$Y$33,IF($AH$34=AI33,$Y$34,IF($AH$35=AI33,$Y$35,IF($AH$36=AI33,$Y$36)))))","v":""}]
[null,null,"C",1,27,"15:30:00",1,{"$f":"'TAB 24 P+B QUALIF'!C30","v":"T / 15"},"/",{"$f":"'TAB 24 P+B QUALIF'!C31","v":"T / 22"},0,"/",0,null,null,null,null,null,null,"","",null,null,null,{"$f":"'TAB 24 P+B QUALIF'!C50","v":"T / 7"},{"$f":"COUNTIF(PLACE1,Y34)*2+COUNTIF(PLACE2,Y34)","v":0},{"$f":"SUMIF(LISTEE1,Y34,(SCEQ1))+SUMIF(LISTEE2,Y34,(SCEQ2))","v":0},{"$f":"SUMIF(LISTEE1,Y34,SCEQ2)+SUMIF(LISTEE2,Y34,SCEQ1)","v":0},{"$f":"(SUMPRODUCT((LISTEE1=Y34)*((S1EQ1)+(S2EQ1)+(S3EQ1))))+(SUMPRODUCT((LISTEE2=Y34)*((S1EQ2)+(S2EQ2)+(S3EQ3))))","v":0},{"$f":"(SUMPRODUCT((LISTEE2=Y34)*((S1EQ1)+(S2EQ1)+(S3EQ1))))+(SUMPRODUCT((LISTEE1=Y34)*((S1EQ2)+(S2EQ2)+(S3EQ3))))","v":0},{"$f":"IFERROR(AA34/AB34,0)","v":0},0,{"$f":"Z34+AE34/100+AF34/100","v":0},{"$f":"IF(Z34=0,\"\",RANK(AG34,$AG$33:$AG$36))","v":""},2,{"$f":"IF(Z34=0,\"\",IF($AH$33=AI34,$Y$33,IF($AH$34=AI34,$Y$34,IF($AH$35=AI34,$Y$35,IF($AH$36=AI34,$Y$36)))))","v":""}]
[null,null,"D",1,28,"15:30:00",2,{"$f":"'TAB 24 P+B QUALIF'!C37","v":"T / 16"},"/",{"$f":"'TAB 24 P+B QUALIF'!C38","v":"T / 21"},0,"/",0,null,null,null,null,null,null,"","",null,null,null,{"$f":"'TAB 24 P+B QUALIF'!C51","v":"T / 18"},{"$f":"COUNTIF(PLACE1,Y35)*2+COUNTIF(PLACE2,Y35)","v":0},{"$f":"SUMIF(LISTEE1,Y35,(SCEQ1))+SUMIF(LISTEE2,Y35,(SCEQ2))","v":0},{"$f":"SUMIF(LISTEE1,Y35,SCEQ2)+SUMIF(LISTEE2,Y35,SCEQ1)","v":0},{"$f":"(SUMPRODUCT((LISTEE1=Y35)*((S1EQ1)+(S2EQ1)+(S3EQ1))))+(SUMPRODUCT((LISTEE2=Y35)*((S1EQ2)+(S2EQ2)+(S3EQ3))))","v":0},{"$f":"(SUMPRODUCT((LISTEE2=Y35)*((S1EQ1)+(S2EQ1)+(S3EQ1))))+(SUMPRODUCT((LISTEE1=Y35)*((S1EQ2)+(S2EQ2)+(S3EQ3))))","v":0},0,0,0,"",3,""]
[null,null,"E",1,29,"16:00:00",1,{"$f":"'TAB 24 P+B QUALIF'!C44","v":"T / 17"},"/",{"$f":"'TAB 24 P+B QUALIF'!C45","v":"T / 20"},0,"/",0,null,null,null,null,null,null,"","",null,null,null,{"$f":"'TAB 24 P+B QUALIF'!C52","v":"T / 19"},{"$f":"COUNTIF(PLACE1,Y36)*2+COUNTIF(PLACE2,Y36)","v":0},{"$f":"SUMIF(LISTEE1,Y36,(SCEQ1))+SUMIF(LISTEE2,Y36,(SCEQ2))","v":0},{"$f":"SUMIF(LISTEE1,Y36,SCEQ2)+SUMIF(LISTEE2,Y36,SCEQ1)","v":0},{"$f":"(SUMPRODUCT((LISTEE1=Y36)*((S1EQ1)+(S2EQ1)+(S3EQ1))))+(SUMPRODUCT((LISTEE2=Y36)*((S1EQ2)+(S2EQ2)+(S3EQ3))))","v":0},{"$f":"(SUMPRODUCT((LISTEE2=Y36)*((S1EQ1)+(S2EQ1)+(S3EQ1))))+(SUMPRODUCT((LISTEE1=Y36)*((S1EQ2)+(S2EQ2)+(S3EQ3))))","v":0},0,0,0,"",4,{"$f":"IF(Z36=0,\"\",IF($AH$33=AI36,$Y$33,IF($AH$34=AI36,$Y$34,IF($AH$35=AI36,$Y$35,IF($AH$36=AI36,$Y$36)))))","v":""}]
[null,null,"F",1,30,"16:00:00",2,{"$f":"'TAB 24 P+B QUALIF'!C51","v":"T / 18"},"/",{"$f":"'TAB 24 P+B QUALIF'!C52","v":"T / 19"},0,"/",0,null,null,null,null,null,null,"",""]
[null,null,"A",1,31,"16:30:00",1,{"$f":"'TAB 24 P+B QUALIF'!C14","v":"T / 1"},"/",{"$f":"'TAB 24 P+B QUALIF'!C15","v":"T / 12"},0,"/",0,null,null,null,null,null,null,"",""]
[null,null,"B",1,32,"16:30:00",2,{"$f":"'TAB 24 P+B QUALIF'!C21","v":"T / 2"},"/",{"$f":"'TAB 24 P+B QUALIF'!C22","v":"T / 11"},0,"/",0,null,null,null,null,null,null,"",""]
[null,null,"C",1,33,"17:00:00",1,{"$f":"'TAB 24 P+B QUALIF'!C28","v":"T / 3"},"/",{"$f":"'TAB 24 P+B QUALIF'!C29","v":"T / 10"},0,"/",0,null,null,null,null,null,null,"",""]
[null,null,"D",1,34,{"$f":"F40+$B$4","v":"17:30:00"},2,{"$f":"'TAB 24 P+B QUALIF'!C35","v":"T / 4"},"/",{"$f":"'TAB 24 P+B QUALIF'!C36","v":"T / 9"},0,"/",0,null,null,null,null,null,null,"",""]
[null,null,"E",1,35,{"$f":"F41+$B$4","v":"18:00:00"},1,{"$f":"'TAB 24 P+B QUALIF'!C42","v":"T / 5"},"/",{"$f":"'TAB 24 P+B QUALIF'!C43","v":"T / 8"},0,"/",0,null,null,null,null,null,null,"",""]
[null,null,"F",1,36,{"$f":"F42+$B$4","v":"18:30:00"},2,{"$f":"'TAB 24 P+B QUALIF'!C49","v":"T / 6"},"/",{"$f":"'TAB 24 P+B QUALIF'!C50","v":"T / 7"},0,"/",0,null,null,null,null,null,null,"",""]
[null,null,"BARR",null,37,{"$f":"B5","v":"09:00:00"},null,{"$f":"AJ9","v":""},"/",{"$f":"AJ34","v":""},0,"/",0,null,null,null,null,null,null,"",""]
[null,null,"BARR",null,38,{"$f":"B5","v":"09:00:00"},null,{"$f":"AJ14","v":""},"/",{"$f":"AJ23","v":""},0,"/",0,null,null,null,null,null,null,"",""]
[null,null,"BARR",null,39,{"$f":"F44+B4","v":"09:30:00"},null,{"$f":"AJ19","v":""},"/",{"$f":"AJ28","v":""},0,"/",0,null,null,null,null,null,null,"",""]
[null,null,"BARR",null,40,{"$f":"F45+B4","v":"09:30:00"},null,{"$f":"AJ24","v":""},"/",{"$f":"AJ19","v":""},0,"/",0,null,null,null,null,null,null,"",""]
[null,null,"BARR",null,41,{"$f":"F46+B4","v":"10:00:00"},null,{"$f":"AJ29","v":""},"/",{"$f":"AJ9","v":""},0,"/",0,null,null,null,null,null,null,"",""]
[null,null,"BARR",null,42,{"$f":"F46+B4","v":"10:00:00"},null,{"$f":"AJ34","v":""},"/",{"$f":"AJ14","v":""},0,"/",0,null,null,null,null,null,null,"",""]

{"sheet":"TAB 24 P+B QUALIF","index":5,"n_rows":53,"n_cols":14,"rows_kept":53,"cut":false,"hidden":false,"merged":[[0,5,2,12],[0,13,5,14],[3,5,3,8],[3,9,3,10],[3,11,3,12],[4,5,4,12],[5,5,5,12]]}
[null,null,null,null,null,{"$f":"IF('LISTE ENGAGES'!R3=\"\",'LISTE ENGAGES'!Q3,'LISTE ENGAGES'!R3)","v":"APPELATION TOURNOI"},null,null,null,null,null,null,null,{"$f":"IF('LISTE ENGAGES'!R10=\"\",'LISTE ENGAGES'!Q10,'LISTE ENGAGES'!R10)","v":"ORGANISATEUR"}]
[]
[]
[null,null,null,null,null,{"$f":"IF('LISTE ENGAGES'!R4=\"\",'LISTE ENGAGES'!Q4,'LISTE ENGAGES'!R4)","v":"LIEU"},null,null,null,{"$f":"IF('LISTE ENGAGES'!R6=\"\",\"DATE\",CONCATENATE('LISTE ENGAGES'!R7,\"-\",'LISTE ENGAGES'!R8,\"/\",'LISTE ENGAGES'!R6))","v":"DATE"},null,{"$f":"IF('LISTE ENGAGES'!R9=\"\",'LISTE ENGAGES'!Q9,'LISTE ENGAGES'!R9)","v":"GENRE"}]
[null,null,null,null,null,{"$f":"IF('LISTE ENGAGES'!R5=\"\",'LISTE ENGAGES'!Q5,'LISTE ENGAGES'!R5)","v":"TYPE"}]
[null,null,null,null,null,"TABLEAU PRINCIPAL"]
[]
[]
[]
[null,null,"POULES",null,null,"RESULTAS",null,"CLASS. POULE",null,null,"BARRAGES"]
[]
[]
[null,null,null,{"$f":"CONCATENATE(B14,\"/\",B17)","v":"T1/T24"},"(1)",{"$f":"IF('SCORE 24 QUALIF'!K8='SCORE 24 QUALIF'!M8,\"\",CONCATENATE('SCORE 24 QUALIF'!K8,\" / \",'SCORE 24 QUALIF'!M8,\"   (\",'SCORE 24 QUALIF'!N8,\" : \",'SCORE 24 QUALIF'!O8,\")\",\" (\",'SCORE 24 QUALIF'!P8,\" : \",'SCORE 24 QUALIF'!Q8,\")\",\" (\",'SCORE 24 QUALIF'!R8,\" : \",'SCORE 24 QUALIF'!S8,\")\"))","v":""},1,{"$f":"'SCORE 24 QUALIF'!AJ8","v":""},"Qualifié",null,{"$f":"IF('SCORE 24 QUALIF'!AJ9=\"\",\"2A\",'SCORE 24 QUALIF'!AJ9)","v":"2A"}]
[null,"T1",{"$f":"CONCATENATE('EMARG M Tableau QUALIF'!C9,\" / \",'EMARG M Tableau QUALIF'!E9)","v":"T / 1"},{"$f":"CONCATENATE(B15,\"/\",B16)","v":"T12/T13"},"(7)",{"$f":"IF('SCORE 24 QUALIF'!K14='SCORE 24 QUALIF'!M14,\"\",CONCATENATE('SCORE 24 QUALIF'!K14,\" / \",'SCORE 24 QUALIF'!M14,\"   (\",'SCORE 24 QUALIF'!N14,\" : \",'SCORE 24 QUALIF'!O14,\")\",\" (\",'SCORE 24 QUALIF'!P14,\" : \",'SCORE 24 QUALIF'!Q14,\")\",\" (\",'SCORE 24 QUALIF'!R14,\" : \",'SCORE 24 QUALIF'!S14,\")\"))","v":""},2,{"$f":"'SCORE 24 QUALIF'!AJ9","v":""},null,null,null,null,{"$f":"'SCORE 24 QUALIF'!T44","v":""}]
["A","T12",{"$f":"CONCATENATE('EMARG M Tableau QUALIF'!C20,\" / \",'EMARG M Tableau QUALIF'!E20)","v":"T / 12"},{"$f":"CONCATENATE(B15,\"/\",B17)","v":"T12/T24"},"(13)",{"$f":"IF('SCORE 24 QUALIF'!K20='SCORE 24 QUALIF'!M20,\"\",CONCATENATE('SCORE 24 QUALIF'!K20,\" / \",'SCORE 24 QUALIF'!M20,\"   (\",'SCORE 24 QUALIF'!N20,\" : \",'SCORE 24 QUALIF'!O20,\")\",\" (\",'SCORE 24 QUALIF'!P20,\" : \",'SCORE 24 QUALIF'!Q20,\")\",\" (\",'SCORE 24 QUALIF'!R20,\" : \",'SCORE 24 QUALIF'!S20,\")\"))","v":""},3,{"$f":"'SCORE 24 QUALIF'!AJ10","v":""},null,null,"(37)",null,{"$f":"IF('SCORE 24 QUALIF'!K44='SCORE 24 QUALIF'!M44,\"\",CONCATENATE('SCORE 24 QUALIF'!K44,\" / \",'SCORE 24 QUALIF'!M44,\"   (\",'SCORE 24 QUALIF'!N44,\" : \",'SCORE 24 QUALIF'!O44,\")\",\" (\",'SCORE 24 QUALIF'!P44,\" : \",'SCORE 24 QUALIF'!Q44,\")\",\" (\",'SCORE 24 QUALIF'!R44,\" : \",'SCORE 24 QUALIF'!S44,\")\"))","v":""}]
[null,"T13",{"$f":"CONCATENATE('EMARG M Tableau QUALIF'!C21,\" / \",'EMARG M Tableau QUALIF'!E21)","v":"T / 13"},{"$f":"CONCATENATE(B14,\"/\",B16)","v":"T1/T13"},"(19)",{"$f":"IF('SCORE 24 QUALIF'!K26='SCORE 24 QUALIF'!M26,\"\",CONCATENATE('SCORE 24 QUALIF'!K26,\" / \",'SCORE 24 QUALIF'!M26,\"   (\",'SCORE 24 QUALIF'!N26,\" : \",'SCORE 24 QUALIF'!O26,\")\",\" (\",'SCORE 24 QUALIF'!P26,\" : \",'SCORE 24 QUALIF'!Q26,\")\",\" (\",'SCORE 24 QUALIF'!R26,\" : \",'SCORE 24 QUALIF'!S26,\")\"))","v":""},4,{"$f":"'SCORE 24 QUALIF'!AJ11","v":""},null,null,{"$f":"IF('SCORE 24 QUALIF'!J44=\"\",\"3 poule (B,C,D,E,F)\",'SCORE 24 QUALIF'!J44)","v":"3 poule (B,C,D,E,F)"}]
[null,"T24",{"$f":"CONCATENATE('EMARG M Tableau QUALIF'!C32,\" / \",'EMARG M Tableau QUALIF'!E32)","v":"T / 24"},{"$f":"CONCATENATE(B16,\"/\",B17)","v":"T13/T24"},"(25)",{"$f":"IF('SCORE 24 QUALIF'!K32='SCORE 24 QUALIF'!M32,\"\",CONCATENATE('SCORE 24 QUALIF'!K32,\" / \",'SCORE 24 QUALIF'!M32,\"   (\",'SCORE 24 QUALIF'!N32,\" : \",'SCORE 24 QUALIF'!O32,\")\",\" (\",'SCORE 24 QUALIF'!P32,\" : \",'SCORE 24 QUALIF'!Q32,\")\",\" (\",'SCORE 24 QUALIF'!R32,\" : \",'SCORE 24 QUALIF'!S32,\")\"))","v":""}]
[null,null,null,{"$f":"CONCATENATE(B14,\"/\",B15)","v":"T1/T12"},"(31)",{"$f":"IF('SCORE 24 QUALIF'!K38='SCORE 24 QUALIF'!M38,\"\",CONCATENATE('SCORE 24 QUALIF'!K38,\" / \",'SCORE 24 QUALIF'!M38,\"   (\",'SCORE 24 QUALIF'!N38,\" : \",'SCORE 24 QUALIF'!O38,\")\",\" (\",'SCORE 24 QUALIF'!P38,\" : \",'SCORE 24 QUALIF'!Q38,\")\",\" (\",'SCORE 24 QUALIF'!R38,\" : \",'SCORE 24 QUALIF'!S38,\")\"))","v":""},null,null,null,null,null,null,"(45)"]
[]
[null,null,null,{"$f":"CONCATENATE(B21,\"/\",B24)","v":"T2/T23"},"(2)",{"$f":"IF('SCORE 24 QUALIF'!K9='SCORE 24 QUALIF'!M9,\"\",CONCATENATE('SCORE 24 QUALIF'!K9,\" / \",'SCORE 24 QUALIF'!M9,\"   (\",'SCORE 24 QUALIF'!N9,\" : \",'SCORE 24 QUALIF'!O9,\")\",\" (\",'SCORE 24 QUALIF'!P9,\" : \",'SCORE 24 QUALIF'!Q9,\")\",\" (\",'SCORE 24 QUALIF'!R9,\" : \",'SCORE 24 QUALIF'!S9,\")\"))","v":""},1,{"$f":"'SCORE 24 QUALIF'!AJ13","v":""},"Qualifié"]
[null,"T2",{"$f":"CONCATENATE('EMARG M Tableau QUALIF'!C10,\" / \",'EMARG M Tableau QUALIF'!E10)","v":"T / 2"},{"$f":"CONCATENATE(B22,\"/\",B23)","v":"T11/T14"},"(8)",{"$f":"IF('SCORE 24 QUALIF'!K15='SCORE 24 QUALIF'!M15,\"\",CONCATENATE('SCORE 24 QUALIF'!K15,\" / \",'SCORE 24 QUALIF'!M15,\"   (\",'SCORE 24 QUALIF'!N15,\" : \",'SCORE 24 QUALIF'!O15,\")\",\" (\",'SCORE 24 QUALIF'!P15,\" : \",'SCORE 24 QUALIF'!Q15,\")\",\" (\",'SCORE 24 QUALIF'!R15,\" : \",'SCORE 24 QUALIF'!S15,\")\"))","v":""},2,{"$f":"'SCORE 24 QUALIF'!AJ14","v":""},null,null,{"$f":"IF('SCORE 24 QUALIF'!AJ14=\"\",\"2B\",'SCORE 24 QUALIF'!AJ14)","v":"2B"}]
["B","T11",{"$f":"CONCATENATE('EMARG M Tableau QUALIF'!C19,\" / \",'EMARG M Tableau QUALIF'!E19)","v":"T / 11"},{"$f":"CONCATENATE(B22,\"/\",B24)","v":"T11/T23"},"(14)",{"$f":"IF('SCORE 24 QUALIF'!K21='SCORE 24 QUALIF'!M21,\"\",CONCATENATE('SCORE 24 QUALIF'!K21,\" / \",'SCORE 24 QUALIF'!M21,\"   (\",'SCORE 24 QUALIF'!N21,\" : \",'SCORE 24 QUALIF'!O21,\")\",\" (\",'SCORE 24 QUALIF'!P21,\" : \",'SCORE 24 QUALIF'!Q21,\")\",\" (\",'SCORE 24 QUALIF'!R21,\" : \",'SCORE 24 QUALIF'!S21,\")\"))","v":""},3,{"$f":"'SCORE 24 QUALIF'!AJ15","v":""},null,null,null,null,{"$f":"'SCORE 24 QUALIF'!T45","v":""}]
[null,"T14",{"$f":"CONCATENATE('EMARG M Tableau QUALIF'!C22,\" / \",'EMARG M Tableau QUALIF'!E22)","v":"T / 14"},{"$f":"CONCATENATE(B21,\"/\",B23)","v":"T2/T14"},"(20)",{"$f":"IF('SCORE 24 QUALIF'!K27='SCORE 24 QUALIF'!M27,\"\",CONCATENATE('SCORE 24 QUALIF'!K27,\" / \",'SCORE 24 QUALIF'!M27,\"   (\",'SCORE 24 QUALIF'!N27,\" : \",'SCORE 24 QUALIF'!O27,\")\",\" (\",'SCORE 24 QUALIF'!P27,\" : \",'SCORE 24 QUALIF'!Q27,\")\",\" (\",'SCORE 24 QUALIF'!R27,\" : \",'SCORE 24 QUALIF'!S27,\")\"))","v":""},4,{"$f":"'SCORE 24 QUALIF'!AJ16","v":""},null,null,"(38)",null,{"$f":"IF('SCORE 24 QUALIF'!K45='SCORE 24 QUALIF'!M45,\"\",CONCATENATE('SCORE 24 QUALIF'!K45,\" / \",'SCORE 24 QUALIF'!M45,\"   (\",'SCORE 24 QUALIF'!N45,\" : \",'SCORE 24 QUALIF'!O45,\")\",\" (\",'SCORE 24 QUALIF'!P45,\" : \",'SCORE 24 QUALIF'!Q45,\")\",\" (\",'SCORE 24 QUALIF'!R45,\" : \",'SCORE 24 QUALIF'!S45,\")\"))","v":""}]
[null,"T23",{"$f":"CONCATENATE('EMARG M Tableau QUALIF'!C31,\" / \",'EMARG M Tableau QUALIF'!E31)","v":"T / 23"},{"$f":"CONCATENATE(B23,\"/\",B24)","v":"T14/T23"},"(26)",{"$f":"IF('SCORE 24 QUALIF'!K33='SCORE 24 QUALIF'!M33,\"\",CONCATENATE('SCORE 24 QUALIF'!K33,\" / \",'SCORE 24 QUALIF'!M33,\"   (\",'SCORE 24 QUALIF'!N33,\" : \",'SCORE 24 QUALIF'!O33,\")\",\" (\",'SCORE 24 QUALIF'!P33,\" : \",'SCORE 24 QUALIF'!Q33,\")\",\" (\",'SCORE 24 QUALIF'!R33,\" : \",'SCORE 24 QUALIF'!S33,\")\"))","v":""},null,null,null,null,{"$f":"IF('SCORE 24 QUALIF'!J45=\"\",\"3 poule (A,C,D,E,F)\",'SCORE 24 QUALIF'!J45)","v":"3 poule (A,C,D,E,F)"}]
[null,null,null,{"$f":"CONCATENATE(B21,\"/\",B22)","v":"T2/T11"},"(32)",{"$f":"IF('SCORE 24 QUALIF'!K39='SCORE 24 QUALIF'!M39,\"\",CONCATENATE('SCORE 24 QUALIF'!K39,\" / \",'SCORE 24 QUALIF'!M39,\"   (\",'SCORE 24 QUALIF'!N39,\" : \",'SCORE 24 QUALIF'!O39,\")\",\" (\",'SCORE 24 QUALIF'!P39,\" : \",'SCORE 24 QUALIF'!Q39,\")\",\" (\",'SCORE 24 QUALIF'!R39,\" : \",'SCORE 24 QUALIF'!S39,\")\"))","v":""}]
[null,null,null,null,null,null,null,null,null,null,{"$f":"IF('SCORE 24 QUALIF'!AJ19=\"\",\"2C\",'SCORE 24 QUALIF'!AJ19)","v":"2C"}]
[null,null,null,{"$f":"CONCATENATE(B28,\"/\",B31)","v":"T3/T22"},"(3)",{"$f":"IF('SCORE 24 QUALIF'!K10='SCORE 24 QUALIF'!M10,\"\",CONCATENATE('SCORE 24 QUALIF'!K10,\" / \",'SCORE 24 QUALIF'!M10,\"   (\",'SCORE 24 QUALIF'!N10,\" : \",'SCORE 24 QUALIF'!O10,\")\",\" (\",'SCORE 24 QUALIF'!P10,\" : \",'SCORE 24 QUALIF'!Q10,\")\",\" (\",'SCORE 24 QUALIF'!R10,\" : \",'SCORE 24 QUALIF'!S10,\")\"))","v":""},1,{"$f":"'SCORE 24 QUALIF'!AJ18","v":""},"Qualifié",null,null,null,{"$f":"'SCORE 24 QUALIF'!T46","v":""}]
[null,"T3",{"$f":"CONCATENATE('EMARG M Tableau QUALIF'!C11,\" / \",'EMARG M Tableau QUALIF'!E11)","v":"T / 3"},{"$f":"CONCATENATE(B29,\"/\",B30)","v":"T10/T15"},"(9)",{"$f":"IF('SCORE 24 QUALIF'!K16='SCORE 24 QUALIF'!M16,\"\",CONCATENATE('SCORE 24 QUALIF'!K16,\" / \",'SCORE 24 QUALIF'!M16,\"   (\",'SCORE 24 QUALIF'!N16,\" : \",'SCORE 24 QUALIF'!O16,\")\",\" (\",'SCORE 24 QUALIF'!P16,\" : \",'SCORE 24 QUALIF'!Q16,\")\",\" (\",'SCORE 24 QUALIF'!R16,\" : \",'SCORE 24 QUALIF'!S16,\")\"))","v":""},2,{"$f":"'SCORE 24 QUALIF'!AJ19","v":""},null,null,"(39)",null,{"$f":"IF('SCORE 24 QUALIF'!K46='SCORE 24 QUALIF'!M46,\"\",CONCATENATE('SCORE 24 QUALIF'!K46,\" / \",'SCORE 24 QUALIF'!M46,\"   (\",'SCORE 24 QUALIF'!N46,\" : \",'SCORE 24 QUALIF'!O46,\")\",\" (\",'SCORE 24 QUALIF'!P46,\" : \",'SCORE 24 QUALIF'!Q46,\")\",\" (\",'SCORE 24 QUALIF'!R46,\" : \",'SCORE 24 QUALIF'!S46,\")\"))","v":""}]
["C","T10",{"$f":"CONCATENATE('EMARG M Tableau QUALIF'!C18,\" / \",'EMARG M Tableau QUALIF'!E18)","v":"T / 10"},{"$f":"CONCATENATE(B29,\"/\",B31)","v":"T10/T22"},"(15)",{"$f":"IF('SCORE 24 QUALIF'!K22='SCORE 24 QUALIF'!M22,\"\",CONCATENATE('SCORE 24 QUALIF'!K22,\" / \",'SCORE 24 QUALIF'!M22,\"   (\",'SCORE 24 QUALIF'!N22,\" : \",'SCORE 24 QUALIF'!O22,\")\",\" (\",'SCORE 24 QUALIF'!P22,\" : \",'SCORE 24 QUALIF'!Q22,\")\",\" (\",'SCORE 24 QUALIF'!R22,\" : \",'SCORE 24 QUALIF'!S22,\")\"))","v":""},3,{"$f":"'SCORE 24 QUALIF'!AJ20","v":""},null,null,{"$f":"IF('SCORE 24 QUALIF'!J46=\"\",\"3 poule (A,B,D,E,F)\",'SCORE 24 QUALIF'!J46)","v":"3 poule (A,B,D,E,F)"}]
[null,"T15",{"$f":"CONCATENATE('EMARG M Tableau QUALIF'!C23,\" / \",'EMARG M Tableau QUALIF'!E23)","v":"T / 15"},{"$f":"CONCATENATE(B28,\"/\",B30)","v":"T3/T15"},"(21)",{"$f":"IF('SCORE 24 QUALIF'!K28='SCORE 24 QUALIF'!M28,\"\",CONCATENATE('SCORE 24 QUALIF'!K28,\" / \",'SCORE 24 QUALIF'!M28,\"   (\",'SCORE 24 QUALIF'!N28,\" : \",'SCORE 24 QUALIF'!O28,\")\",\" (\",'SCORE 24 QUALIF'!P28,\" : \",'SCORE 24 QUALIF'!Q28,\")\",\" (\",'SCORE 24 QUALIF'!R28,\" : \",'SCORE 24 QUALIF'!S28,\")\"))","v":""},4,{"$f":"'SCORE 24 QUALIF'!AJ21","v":""},null,null,null,null,"(46)"]
[null,"T22",{"$f":"CONCATENATE('EMARG M Tableau QUALIF'!C30,\" / \",'EMARG M Tableau QUALIF'!E30)","v":"T / 22"},{"$f":"CONCATENATE(B30,\"/\",B31)","v":"T15/T22"},"(27)",{"$f":"IF('SCORE 24 QUALIF'!K34='SCORE 24 QUALIF'!M34,\"\",CONCATENATE('SCORE 24 QUALIF'!K34,\" / \",'SCORE 24 QUALIF'!M34,\"   (\",'SCORE 24 QUALIF'!N34,\" : \",'SCORE 24 QUALIF'!O34,\")\",\" (\",'SCORE 24 QUALIF'!P34,\" : \",'SCORE 24 QUALIF'!Q34,\")\",\" (\",'SCORE 24 QUALIF'!R34,\" : \",'SCORE 24 QUALIF'!S34,\")\"))","v":""}]
[null,null,null,{"$f":"CONCATENATE(B28,\"/\",B29)","v":"T3/T10"},"(33)",{"$f":"IF('SCORE 24 QUALIF'!K40='SCORE 24 QUALIF'!M40,\"\",CONCATENATE('SCORE 24 QUALIF'!K40,\" / \",'SCORE 24 QUALIF'!M40,\"   (\",'SCORE 24 QUALIF'!N40,\" : \",'SCORE 24 QUALIF'!O40,\")\",\" (\",'SCORE 24 QUALIF'!P40,\" : \",'SCORE 24 QUALIF'!Q40,\")\",\" (\",'SCORE 24 QUALIF'!R40,\" : \",'SCORE 24 QUALIF'!S40,\")\"))","v":""}]
[]
[null,null,null,{"$f":"CONCATENATE(B35,\"/\",B38)","v":"T4/T21"},"(4)",{"$f":"IF('SCORE 24 QUALIF'!K11='SCORE 24 QUALIF'!M11,\"\",CONCATENATE('SCORE 24 QUALIF'!K11,\" / \",'SCORE 24 QUALIF'!M11,\"   (\",'SCORE 24 QUALIF'!N11,\" : \",'SCORE 24 QUALIF'!O11,\")\",\" (\",'SCORE 24 QUALIF'!P11,\" : \",'SCORE 24 QUALIF'!Q11,\")\",\" (\",'SCORE 24 QUALIF'!R11,\" : \",'SCORE 24 QUALIF'!S11,\")\"))","v":""},1,{"$f":"'SCORE 24 QUALIF'!AJ23","v":""},"Qualifié",null,{"$f":"IF('SCORE 24 QUALIF'!AJ24=\"\",\"2D\",'SCORE 24 QUALIF'!AJ24)","v":"2D"}]
[null,"T4",{"$f":"CONCATENATE('EMARG M Tableau QUALIF'!C12,\" / \",'EMARG M Tableau QUALIF'!E12)","v":"T / 4"},{"$f":"CONCATENATE(B36,\"/\",B37)","v":"T9/T16"},"(10)",{"$f":"IF('SCORE 24 QUALIF'!K17='SCORE 24 QUALIF'!M17,\"\",CONCATENATE('SCORE 24 QUALIF'!K17,\" / \",'SCORE 24 QUALIF'!M17,\"   (\",'SCORE 24 QUALIF'!N17,\" : \",'SCORE 24 QUALIF'!O17,\")\",\" (\",'SCORE 24 QUALIF'!P17,\" : \",'SCORE 24 QUALIF'!Q17,\")\",\" (\",'SCORE 24 QUALIF'!R17,\" : \",'SCORE 24 QUALIF'!S17,\")\"))","v":""},2,{"$f":"'SCORE 24 QUALIF'!AJ24","v":""},null,null,null,null,{"$f":"'SCORE 24 QUALIF'!T47","v":""}]
["D","T9",{"$f":"CONCATENATE('EMARG M Tableau QUALIF'!C17,\" / \",'EMARG M Tableau QUALIF'!E17)","v":"T / 9"},{"$f":"CONCATENATE(B36,\"/\",B38)","v":"T9/T21"},"(16)",{"$f":"IF('SCORE 24 QUALIF'!K23='SCORE 24 QUALIF'!M23,\"\",CONCATENATE('SCORE 24 QUALIF'!K23,\" / \",'SCORE 24 QUALIF'!M23,\"   (\",'SCORE 24 QUALIF'!N23,\" : \",'SCORE 24 QUALIF'!O23,\")\",\" (\",'SCORE 24 QUALIF'!P23,\" : \",'SCORE 24 QUALIF'!Q23,\")\",\" (\",'SCORE 24 QUALIF'!R23,\" : \",'SCORE 24 QUALIF'!S23,\")\"))","v":""},3,{"$f":"'SCORE 24 QUALIF'!AJ25","v":""},null,null," (40)",null,{"$f":"IF('SCORE 24 QUALIF'!K47='SCORE 24 QUALIF'!M47,\"\",CONCATENATE('SCORE 24 QUALIF'!K47,\" / \",'SCORE 24 QUALIF'!M47,\"   (\",'SCORE 24 QUALIF'!N47,\" : \",'SCORE 24 QUALIF'!O47,\")\",\" (\",'SCORE 24 QUALIF'!P47,\" : \",'SCORE 24 QUALIF'!Q47,\")\",\" (\",'SCORE 24 QUALIF'!R47,\" : \",'SCORE 24 QUALIF'!S47,\")\"))","v":""}]
[null,"T16",{"$f":"CONCATENATE('EMARG M Tableau QUALIF'!C24,\" / \",'EMARG M Tableau QUALIF'!E24)","v":"T / 16"},{"$f":"CONCATENATE(B35,\"/\",B37)","v":"T4/T16"},"(22)",{"$f":"IF('SCORE 24 QUALIF'!K29='SCORE 24 QUALIF'!M29,\"\",CONCATENATE('SCORE 24 QUALIF'!K29,\" / \",'SCORE 24 QUALIF'!M29,\"   (\",'SCORE 24 QUALIF'!N29,\" : \",'SCORE 24 QUALIF'!O29,\")\",\" (\",'SCORE 24 QUALIF'!P29,\" : \",'SCORE 24 QUALIF'!Q29,\")\",\" (\",'SCORE 24 QUALIF'!R29,\" : \",'SCORE 24 QUALIF'!S29,\")\"))","v":""},4,{"$f":"'SCORE 24 QUALIF'!AJ26","v":""},null,null,{"$f":"IF('SCORE 24 QUALIF'!J47=\"\",\"3 poule (A,B,C,E,F)\",'SCORE 24 QUALIF'!J47)","v":"3 poule (A,B,C,E,F)"}]
[null,"T21",{"$f":"CONCATENATE('EMARG M Tableau QUALIF'!C29,\" / \",'EMARG M Tableau QUALIF'!E29)","v":"T / 21"},{"$f":"CONCATENATE(B37,\"/\",B38)","v":"T16/T21"},"(28)",{"$f":"IF('SCORE 24 QUALIF'!K35='SCORE 24 QUALIF'!M35,\"\",CONCATENATE('SCORE 24 QUALIF'!K35,\" / \",'SCORE 24 QUALIF'!M35,\"   (\",'SCORE 24 QUALIF'!N35,\" : \",'SCORE 24 QUALIF'!O35,\")\",\" (\",'SCORE 24 QUALIF'!P35,\" : \",'SCORE 24 QUALIF'!Q35,\")\",\" (\",'SCORE 24 QUALIF'!R35,\" : \",'SCORE 24 QUALIF'!S35,\")\"))","v":""}]
[null,null,null,{"$f":"CONCATENATE(B35,\"/\",B36)","v":"T4/T9"},"(34)",{"$f":"IF('SCORE 24 QUALIF'!K41='SCORE 24 QUALIF'!M41,\"\",CONCATENATE('SCORE 24 QUALIF'!K41,\" / \",'SCORE 24 QUALIF'!M41,\"   (\",'SCORE 24 QUALIF'!N41,\" : \",'SCORE 24 QUALIF'!O41,\")\",\" (\",'SCORE 24 QUALIF'!P41,\" : \",'SCORE 24 QUALIF'!Q41,\")\",\" (\",'SCORE 24 QUALIF'!R41,\" : \",'SCORE 24 QUALIF'!S41,\")\"))","v":""},null,null,null,null,{"$f":"IF('SCORE 24 QUALIF'!AJ29=\"\",\"2E\",'SCORE 24 QUALIF'!AJ29)","v":"2E"}]
[null,null,null,null,null,null,null,null,null,null,null,null,{"$f":"'SCORE 24 QUALIF'!T48","v":""}]
[null,null,null,{"$f":"CONCATENATE(B42,\"/\",B45)","v":"T5/T20"},"(5)",{"$f":"IF('SCORE 24 QUALIF'!K12='SCORE 24 QUALIF'!M12,\"\",CONCATENATE('SCORE 24 QUALIF'!K12,\" / \",'SCORE 24 QUALIF'!M12,\"   (\",'SCORE 24 QUALIF'!N12,\" : \",'SCORE 24 QUALIF'!O12,\")\",\" (\",'SCORE 24 QUALIF'!P12,\" : \",'SCORE 24 QUALIF'!Q12,\")\",\" (\",'SCORE 24 QUALIF'!R12,\" : \",'SCORE 24 QUALIF'!S12,\")\"))","v":""},1,{"$f":"'SCORE 24 QUALIF'!AJ28","v":""},"Qualifié",null,"(41)",null,{"$f":"IF('SCORE 24 QUALIF'!K48='SCORE 24 QUALIF'!M48,\"\",CONCATENATE('SCORE 24 QUALIF'!K48,\" / \",'SCORE 24 QUALIF'!M48,\"   (\",'SCORE 24 QUALIF'!N48,\" : \",'SCORE 24 QUALIF'!O48,\")\",\" (\",'SCORE 24 QUALIF'!P48,\" : \",'SCORE 24 QUALIF'!Q48,\")\",\" (\",'SCORE 24 QUALIF'!R48,\" : \",'SCORE 24 QUALIF'!S48,\")\"))","v":""}]
[null,"T5",{"$f":"CONCATENATE('EMARG M Tableau QUALIF'!C13,\" / \",'EMARG M Tableau QUALIF'!E13)","v":"T / 5"},{"$f":"CONCATENATE(B43,\"/\",B44)","v":"T8/T17"},"(11)",{"$f":"IF('SCORE 24 QUALIF'!K18='SCORE 24 QUALIF'!M18,\"\",CONCATENATE('SCORE 24 QUALIF'!K18,\" / \",'SCORE 24 QUALIF'!M18,\"   (\",'SCORE 24 QUALIF'!N18,\" : \",'SCORE 24 QUALIF'!O18,\")\",\" (\",'SCORE 24 QUALIF'!P18,\" : \",'SCORE 24 QUALIF'!Q18,\")\",\" (\",'SCORE 24 QUALIF'!R18,\" : \",'SCORE 24 QUALIF'!S18,\")\"))","v":""},2,{"$f":"'SCORE 24 QUALIF'!AJ29","v":""},null,null,{"$f":"IF('SCORE 24 QUALIF'!J48=\"\",\"3 poule (A,B,C,D,F)\",'SCORE 24 QUALIF'!J48)","v":"3 poule (A,B,C,D,F)"}]
["E","T8",{"$f":"CONCATENATE('EMARG M Tableau QUALIF'!C16,\" / \",'EMARG M Tableau QUALIF'!E16)","v":"T / 8"},{"$f":"CONCATENATE(B43,\"/\",B45)","v":"T8/T20"},"(17)",{"$f":"IF('SCORE 24 QUALIF'!K24='SCORE 24 QUALIF'!M24,\"\",CONCATENATE('SCORE 24 QUALIF'!K24,\" / \",'SCORE 24 QUALIF'!M24,\"   (\",'SCORE 24 QUALIF'!N24,\" : \",'SCORE 24 QUALIF'!O24,\")\",\" (\",'SCORE 24 QUALIF'!P24,\" : \",'SCORE 24 QUALIF'!Q24,\")\",\" (\",'SCORE 24 QUALIF'!R24,\" : \",'SCORE 24 QUALIF'!S24,\")\"))","v":""},3,{"$f":"'SCORE 24 QUALIF'!AJ30","v":""},null,null,null,null,"(47)"]
[null,"T17",{"$f":"CONCATENATE('EMARG M Tableau QUALIF'!C25,\" / \",'EMARG M Tableau QUALIF'!E25)","v":"T / 17"},{"$f":"CONCATENATE(B42,\"/\",B44)","v":"T5/T17"},"(23)",{"$f":"IF('SCORE 24 QUALIF'!K30='SCORE 24 QUALIF'!M30,\"\",CONCATENATE('SCORE 24 QUALIF'!K30,\" / \",'SCORE 24 QUALIF'!M30,\"   (\",'SCORE 24 QUALIF'!N30,\" : \",'SCORE 24 QUALIF'!O30,\")\",\" (\",'SCORE 24 QUALIF'!P30,\" : \",'SCORE 24 QUALIF'!Q30,\")\",\" (\",'SCORE 24 QUALIF'!R30,\" : \",'SCORE 24 QUALIF'!S30,\")\"))","v":""},4,{"$f":"'SCORE 24 QUALIF'!AJ31","v":""}]
[null,"T20",{"$f":"CONCATENATE('EMARG M Tableau QUALIF'!C28,\" / \",'EMARG M Tableau QUALIF'!E28)","v":"T / 20"},{"$f":"CONCATENATE(B44,\"/\",B45)","v":"T17/T20"},"(29)",{"$f":"IF('SCORE 24 QUALIF'!K36='SCORE 24 QUALIF'!M36,\"\",CONCATENATE('SCORE 24 QUALIF'!K36,\" / \",'SCORE 24 QUALIF'!M36,\"   (\",'SCORE 24 QUALIF'!N36,\" : \",'SCORE 24 QUALIF'!O36,\")\",\" (\",'SCORE 24 QUALIF'!P36,\" : \",'SCORE 24 QUALIF'!Q36,\")\",\" (\",'SCORE 24 QUALIF'!R36,\" : \",'SCORE 24 QUALIF'!S36,\")\"))","v":""}]
[null,null,null,{"$f":"CONCATENATE(B42,\"/\",B43)","v":"T5/T8"},"(35)",{"$f":"IF('SCORE 24 QUALIF'!K42='SCORE 24 QUALIF'!M42,\"\",CONCATENATE('SCORE 24 QUALIF'!K42,\" / \",'SCORE 24 QUALIF'!M42,\"   (\",'SCORE 24 QUALIF'!N42,\" : \",'SCORE 24 QUALIF'!O42,\")\",\" (\",'SCORE 24 QUALIF'!P42,\" : \",'SCORE 24 QUALIF'!Q42,\")\",\" (\",'SCORE 24 QUALIF'!R42,\" : \",'SCORE 24 QUALIF'!S42,\")\"))","v":""}]
[null,null,null,null,null,null,null,null,null,null,{"$f":"IF('SCORE 24 QUALIF'!AJ34=\"\",\"2F\",'SCORE 24 QUALIF'!AJ34)","v":"2F"}]
[null,null,null,{"$f":"CONCATENATE(B49,\"/\",B52)","v":"T6/T19"},"(6)",{"$f":"IF('SCORE 24 QUALIF'!K13='SCORE 24 QUALIF'!M13,\"\",CONCATENATE('SCORE 24 QUALIF'!K13,\" / \",'SCORE 24 QUALIF'!M13,\"   (\",'SCORE 24 QUALIF'!N13,\" : \",'SCORE 24 QUALIF'!O13,\")\",\" (\",'SCORE 24 QUALIF'!P13,\" : \",'SCORE 24 QUALIF'!Q13,\")\",\" (\",'SCORE 24 QUALIF'!R13,\" : \",'SCORE 24 QUALIF'!S13,\")\"))","v":""},1,{"$f":"'SCORE 24 QUALIF'!AJ33","v":""},"Qualifié",null,null,null,{"$f":"'SCORE 24 QUALIF'!T49","v":""}]
[null,"T6",{"$f":"CONCATENATE('EMARG M Tableau QUALIF'!C14,\" / \",'EMARG M Tableau QUALIF'!E14)","v":"T / 6"},{"$f":"CONCATENATE(B50,\"/\",B51)","v":"T7/T18"},"(12)",{"$f":"IF('SCORE 24 QUALIF'!K19='SCORE 24 QUALIF'!M19,\"\",CONCATENATE('SCORE 24 QUALIF'!K19,\" / \",'SCORE 24 QUALIF'!M19,\"   (\",'SCORE 24 QUALIF'!N19,\" : \",'SCORE 24 QUALIF'!O19,\")\",\" (\",'SCORE 24 QUALIF'!P19,\" : \",'SCORE 24 QUALIF'!Q19,\")\",\" (\",'SCORE 24 QUALIF'!R19,\" : \",'SCORE 24 QUALIF'!S19,\")\"))","v":""},2,{"$f":"'SCORE 24 QUALIF'!AJ34","v":""},null,null,"(42)",null,{"$f":"IF('SCORE 24 QUALIF'!K49='SCORE 24 QUALIF'!M49,\"\",CONCATENATE('SCORE 24 QUALIF'!K49,\" / \",'SCORE 24 QUALIF'!M49,\"   (\",'SCORE 24 QUALIF'!N49,\" : \",'SCORE 24 QUALIF'!O49,\")\",\" (\",'SCORE 24 QUALIF'!P49,\" : \",'SCORE 24 QUALIF'!Q49,\")\",\" (\",'SCORE 24 QUALIF'!R49,\" : \",'SCORE 24 QUALIF'!S49,\")\"))","v":""}]
["F","T7",{"$f":"CONCATENATE('EMARG M Tableau QUALIF'!C15,\" / \",'EMARG M Tableau QUALIF'!E15)","v":"T / 7"},{"$f":"CONCATENATE(B50,\"/\",B52)","v":"T7/T19"},"(18)",{"$f":"IF('SCORE 24 QUALIF'!K25='SCORE 24 QUALIF'!M25,\"\",CONCATENATE('SCORE 24 QUALIF'!K25,\" / \",'SCORE 24 QUALIF'!M25,\"   (\",'SCORE 24 QUALIF'!N25,\" : \",'SCORE 24 QUALIF'!O25,\")\",\" (\",'SCORE 24 QUALIF'!P25,\" : \",'SCORE 24 QUALIF'!Q25,\")\",\" (\",'SCORE 24 QUALIF'!R25,\" : \",'SCORE 24 QUALIF'!S25,\")\"))","v":""},3,{"$f":"'SCORE 24 QUALIF'!AJ35","v":""},null,null,{"$f":"IF('SCORE 24 QUALIF'!J49=\"\",\"3 poule (A,B,C,D,E)\",'SCORE 24 QUALIF'!J49)","v":"3 poule (A,B,C,D,E)"}]
[null,"T18",{"$f":"CONCATENATE('EMARG M Tableau QUALIF'!C26,\" / \",'EMARG M Tableau QUALIF'!E26)","v":"T / 18"},{"$f":"CONCATENATE(B49,\"/\",B51)","v":"T6/T18"},"(24)",{"$f":"IF('SCORE 24 QUALIF'!K31='SCORE 24 QUALIF'!M31,\"\",CONCATENATE('SCORE 24 QUALIF'!K31,\" / \",'SCORE 24 QUALIF'!M31,\"   (\",'SCORE 24 QUALIF'!N31,\" : \",'SCORE 24 QUALIF'!O31,\")\",\" (\",'SCORE 24 QUALIF'!P31,\" : \",'SCORE 24 QUALIF'!Q31,\")\",\" (\",'SCORE 24 QUALIF'!R31,\" : \",'SCORE 24 QUALIF'!S31,\")\"))","v":""},4,{"$f":"'SCORE 24 QUALIF'!AJ36","v":""}]
[null,"T19",{"$f":"CONCATENATE('EMARG M Tableau QUALIF'!C27,\" / \",'EMARG M Tableau QUALIF'!E27)","v":"T / 19"},{"$f":"CONCATENATE(B51,\"/\",B52)","v":"T18/T19"},"(30)",{"$f":"IF('SCORE 24 QUALIF'!K37='SCORE 24 QUALIF'!M37,\"\",CONCATENATE('SCORE 24 QUALIF'!K37,\" / \",'SCORE 24 QUALIF'!M37,\"   (\",'SCORE 24 QUALIF'!N37,\" : \",'SCORE 24 QUALIF'!O37,\")\",\" (\",'SCORE 24 QUALIF'!P37,\" : \",'SCORE 24 QUALIF'!Q37,\")\",\" (\",'SCORE 24 QUALIF'!R37,\" : \",'SCORE 24 QUALIF'!S37,\")\"))","v":""}]
[null,null,null,{"$f":"CONCATENATE(B49,\"/\",B50)","v":"T6/T7"},"(36)",{"$f":"IF('SCORE 24 QUALIF'!K43='SCORE 24 QUALIF'!M43,\"\",CONCATENATE('SCORE 24 QUALIF'!K43,\" / \",'SCORE 24 QUALIF'!M43,\"   (\",'SCORE 24 QUALIF'!N43,\" : \",'SCORE 24 QUALIF'!O43,\")\",\" (\",'SCORE 24 QUALIF'!P43,\" : \",'SCORE 24 QUALIF'!Q43,\")\",\" (\",'SCORE 24 QUALIF'!R43,\" : \",'SCORE 24 QUALIF'!S43,\")\"))","v":""}]

{"sheet":"EMARG M Tableau PRIN","index":6,"n_rows":37,"n_cols":10,"rows_kept":37,"cut":false,"hidden":false,"merged":[[5,3,5,9],[1,3,2,8],[1,9,3,9],[3,3,3,4],[3,5,3,7],[4,3,4,9]]}
[]
[null,null,null,{"$f":"IF('LISTE ENGAGES'!R3=\"\",'LISTE ENGAGES'!Q3,'LISTE ENGAGES'!R3)","v":"APPELATION TOURNOI"},null,null,null,null,null,{"$f":"'LISTE ENGAGES'!$H$1","v":"ORGANISATEUR"}]
[]
[null,null,null,{"$f":"'LISTE ENGAGES'!$C$4","v":"LIEU"},null,{"$f":"'LISTE ENGAGES'!$G$4","v":"DATE"},null,null,{"$f":"'LISTE ENGAGES'!$H$4","v":"GENRE"}]
[null,null,null,{"$f":"'LISTE ENGAGES'!$C$5","v":"TYPE"}]
[null,null,null,"FEUILLE EMARGEMENT"]
[]
["N°",null,"NOM","PRENOM","NOM","PRENOM","pts","tir","SIGNATURE JOUEUR1","SIGNATURE JOUEUR2"]
[1,null,"T",null,1]
[2,null,"T",null,2]
[3,null,"T",null,3]
[4,null,"T",null,4]
[5,null,"T",null,5]
[6,null,"T",null,6]
[7,null,"T",null,7]
[8,null,"T",null,8]
[9,null,"T",null,9]
[10,null,"T",null,10]
[11,null,"T",null,11]
[12,null,"T",null,12]
[13,null,"T",null,13]
[14,null,"T",null,14]
[15,null,"T",null,15]
[16,null,"T",null,16]
[17,null,"T",null,17]
[18,null,"T",null,18]
[19,null,"T",null,19]
[20,null,"T",null,20]
[21,null,"T",null,21]
[22,null,"T",null,22]
[23,null,"T",null,23]
[24,null,"T",null,24]
[]
[null,null,"Copier/coller selon LISTE ENGAGES en fonction des équipes confirmées APRES les qualifications"]
[null,null,"ATTENTION : Respecter l'ordre des têtes de séries en fonction des points et classement de la LISTE ENGAGES"]
[null,null,{"$f":"CONCATENATE('EMARG M Tableau PRIN'!C19,\" / \")","v":"T / "}]
[null,null,"EX: Si toutes les equipes du tableau principal sont confirmées, les équipes issues qualifications sont replacées en fonction de leurs points, en bas de tableau"]

{"sheet":"PLANNING PS 24","index":7,"n_rows":40,"n_cols":33,"rows_kept":40,"cut":false,"hidden":false,"merged":[[8,2,8,3],[8,21,8,22],[1,7,4,15],[1,16,7,17],[3,2,3,3],[3,21,3,22],[5,7,5,9],[5,10,5,13],[5,14,5,15],[6,7,6,15],[7,7,7,15]]}
[]
[null,null,null,null,null,null,null,{"$f":"IF('LISTE ENGAGES'!R3=\"\",'LISTE ENGAGES'!Q3,'LISTE ENGAGES'!R3)","v":"APPELATION TOURNOI"},null,null,null,null,null,null,null,null,{"$f":"IF('LISTE ENGAGES'!R10=\"\",'LISTE ENGAGES'!Q10,'LISTE ENGAGES'!R10)","v":"ORGANISATEUR"}]
[]
[null,"J1","HEURE DEBUT",null,"09:00:00",null,null,null,null,null,null,null,null,null,null,null,null,null,null,null,"J3","HEURE DEBUT",null,"17:20:00"]
[null,null,"DUREE MATCH",null,"00:45:00",null,null,null,null,null,null,null,null,null,null,null,null,null,null,null,null,"DUREE MATCH",null,"00:50:00"]
[null,null,null,null,null,null,null,{"$f":"IF('LISTE ENGAGES'!R4=\"\",'LISTE ENGAGES'!Q4,'LISTE ENGAGES'!R4)","v":"LIEU"},null,null,{"$f":"IF('LISTE ENGAGES'!R6=\"\",\"DATE\",CONCATENATE('LISTE ENGAGES'!R7,\"-\",'LISTE ENGAGES'!R8,\"/\",'LISTE ENGAGES'!R6))","v":"DATE"},null,null,null,{"$f":"IF('LISTE ENGAGES'!R9=\"\",'LISTE ENGAGES'!Q9,'LISTE ENGAGES'!R9)","v":"GENRE"}]
[null,null,null,null,null,null,null,{"$f":"IF('LISTE ENGAGES'!R5=\"\",'LISTE ENGAGES'!Q5,'LISTE ENGAGES'!R5)","v":"TYPE"}]
[null,null,null,null,null,null,null,"PLANNING DES RENCONTRES"]
[null,"J2","HEURE DEBUT",null,"09:00:00",null,null,null,null,null,null,null,null,null,null,null,null,null,null,null,"J4","HEURE DEBUT",null,"09:00:00"]
[null,null,"DUREE MATCH",null,"00:50:00",null,null,null,null,null,null,null,null,null,null,null,null,null,null,null,null,"DUREE MATCH",null,"01:00:00"]
[]
[]
[]
[]
[]
[null,null,null,null,"MATCH","n°","TER.","E1","./.","E2","ARB","MATCH","n°","TER.","E1","./.","E2","ARB","FORMAT","MATCH","n°","TER.","E1","./.","E2","ARB","MATCH","n°","TER.","E1","./.","E2","ARB"]
[null,null,"JOUR 1",{"$f":"E4","v":"09:00:00"},1,null,1,{"$f":"'TAB24 POULE'!C14","v":"T / 1"},null,{"$f":"'TAB24 POULE'!C17","v":"T / 24"},null,2,null,2,{"$f":"'TAB24 POULE'!C21","v":"T / 2"},null,{"$f":"'TAB24 POULE'!C24","v":"T / 23"},null,"2*15, SD 11",3,null,3,{"$f":"'TAB24 POULE'!C28","v":"T / 3"},null,{"$f":"'TAB24 POULE'!C31","v":"T / 22"}]
[null,null,null,{"$f":"D17+$E$5","v":"09:45:00"},4,null,1,{"$f":"'TAB24 POULE'!C35","v":"T / 4"},null,{"$f":"'TAB24 POULE'!C38","v":"T / 21"},null,5,null,2,{"$f":"'TAB24 POULE'!C42","v":"T / 5"},null,{"$f":"'TAB24 POULE'!C45","v":"T / 20"},null,"2*15, SD 11",6,null,3,{"$f":"'TAB24 POULE'!C49","v":"T / 6"},null,{"$f":"'TAB24 POULE'!C52","v":"T / 19"}]
[null,null,null,{"$f":"D18+$E$5","v":"10:30:00"},7,null,1,{"$f":"'TAB24 POULE'!C15","v":"T / 12"},null,{"$f":"'TAB24 POULE'!C16","v":"T / 13"},null,8,null,2,{"$f":"'TAB24 POULE'!C22","v":"T / 11"},null,{"$f":"'TAB24 POULE'!C23","v":"T / 14"},null,"2*15, SD 11",9,null,3,{"$f":"'TAB24 POULE'!C29","v":"T / 10"},null,{"$f":"'TAB24 POULE'!C30","v":"T / 15"}]
[null,null,null,"11:15:00",10,null,1,{"$f":"'TAB24 POULE'!C36","v":"T / 9"},null,{"$f":"'TAB24 POULE'!C37","v":"T / 16"},null,11,null,2,{"$f":"'TAB24 POULE'!C43","v":"T / 8"},null,{"$f":"'TAB24 POULE'!C44","v":"T / 17"},null,"2*15, SD 11",12,null,3,{"$f":"'TAB24 POULE'!C50","v":"T / 7"},null,{"$f":"'TAB24 POULE'!C51","v":"T / 18"}]
[null,null,null,"12:00:00",13,null,1,{"$f":"'TAB24 POULE'!C15","v":"T / 12"},null,{"$f":"'TAB24 POULE'!C17","v":"T / 24"},null,14,null,2,{"$f":"'TAB24 POULE'!C22","v":"T / 11"},null,{"$f":"'TAB24 POULE'!C24","v":"T / 23"},null,"2*15, SD 11",15,null,3,{"$f":"'TAB24 POULE'!C29","v":"T / 10"},null,{"$f":"'TAB24 POULE'!C31","v":"T / 22"}]
[null,null,null,"12:45:00",16,null,1,{"$f":"'TAB24 POULE'!C36","v":"T / 9"},null,{"$f":"'TAB24 POULE'!C38","v":"T / 21"},null,17,null,2,{"$f":"'TAB24 POULE'!C43","v":"T / 8"},null,{"$f":"'TAB24 POULE'!C45","v":"T / 20"},null,"2*15, SD 11",18,null,3,{"$f":"'TAB24 POULE'!C50","v":"T / 7"},null,{"$f":"'TAB24 POULE'!C52","v":"T / 19"}]
[null,null,null,"13:30:00",19,null,1,{"$f":"'TAB24 POULE'!C14","v":"T / 1"},null,{"$f":"'TAB24 POULE'!C16","v":"T / 13"},null,20,null,2,{"$f":"'TAB24 POULE'!C21","v":"T / 2"},null,{"$f":"'TAB24 POULE'!C23","v":"T / 14"},null,"2*15, SD 11",21,null,3,{"$f":"'TAB24 POULE'!C28","v":"T / 3"},null,{"$f":"'TAB24 POULE'!C30","v":"T / 15"}]
[null,null,null,"14:15:00",22,null,1,{"$f":"'TAB24 POULE'!C35","v":"T / 4"},null,{"$f":"'TAB24 POULE'!C37","v":"T / 16"},null,23,null,2,{"$f":"'TAB24 POULE'!C42","v":"T / 5"},null,{"$f":"'TAB24 POULE'!C44","v":"T / 17"},null,"2*15, SD 11",24,null,3,{"$f":"'TAB24 POULE'!C49","v":"T / 6"},null,{"$f":"'TAB24 POULE'!C51","v":"T / 18"}]
[null,null,null,"15:00:00",25,null,1,{"$f":"'TAB24 POULE'!C16","v":"T / 13"},null,{"$f":"'TAB24 POULE'!C17","v":"T / 24"},null,26,null,2,{"$f":"'TAB24 POULE'!C23","v":"T / 14"},null,{"$f":"'TAB24 POULE'!C24","v":"T / 23"},null,"2*15, SD 11",27,null,3,{"$f":"'TAB24 POULE'!C30","v":"T / 15"},null,{"$f":"'TAB24 POULE'!C31","v":"T / 22"}]
[null,null,null,"15:45:00",28,null,1,{"$f":"'TAB24 POULE'!C37","v":"T / 16"},null,{"$f":"'TAB24 POULE'!C38","v":"T / 21"},null,29,null,2,{"$f":"'TAB24 POULE'!C44","v":"T / 17"},null,{"$f":"'TAB24 POULE'!C45","v":"T / 20"},null,"2*15, SD 11",30,null,3,{"$f":"'TAB24 POULE'!C51","v":"T / 18"},null,{"$f":"'TAB24 POULE'!C52","v":"T / 19"}]
[null,null,null,"16:30:00",31,null,1,{"$f":"'TAB24 POULE'!C14","v":"T / 1"},null,{"$f":"'TAB24 POULE'!C15","v":"T / 12"},null,32,null,2,{"$f":"'TAB24 POULE'!C21","v":"T / 2"},null,{"$f":"'TAB24 POULE'!C22","v":"T / 11"},null,"2*15, SD 11",33,null,3,{"$f":"'TAB24 POULE'!C28","v":"T / 3"},null,{"$f":"'TAB24 POULE'!C29","v":"T / 10"}]
[null,null,null,"17:15:00",34,null,1,{"$f":"'TAB24 POULE'!C35","v":"T / 4"},null,{"$f":"'TAB24 POULE'!C36","v":"T / 9"},null,35,null,2,{"$f":"'TAB24 POULE'!C42","v":"T / 5"},null,{"$f":"'TAB24 POULE'!C43","v":"T / 8"},null,"2*15, SD 11",36,null,3,{"$f":"'TAB24 POULE'!C49","v":"T / 6"},null,{"$f":"'TAB24 POULE'!C50","v":"T / 7"}]
[null,null,"JOUR 2",{"$f":"E9","v":"09:00:00"},37,null,null,{"$f":"'TAB24 POULE'!K13","v":""},null,{"$f":"'TAB24 POULE'!K16","v":""},null,38,null,null,{"$f":"'TAB24 POULE'!K21","v":""},null,{"$f":"'TAB24 POULE'!K24","v":""},null,"2*15, SD 11"]
[null,null,null,{"$f":"D29+$E$10","v":"09:50:00"},39,null,null,{"$f":"'TAB24 POULE'!K26","v":""},null,{"$f":"'TAB24 POULE'!K29","v":""},null,40,null,null,{"$f":"'TAB24 POULE'!K34","v":""},null,{"$f":"'TAB24 POULE'!K37","v":""},null,"2*15, SD 11"]
[null,null,null,{"$f":"D30+$E$10","v":"10:40:00"},41,null,null,{"$f":"'TAB24 POULE'!K39","v":""},null,{"$f":"'TAB24 POULE'!K42","v":""},null,42,null,null,{"$f":"'TAB24 POULE'!K47","v":""},null,{"$f":"'TAB24 POULE'!K50","v":""},null,"2*15, SD 11"]
[null,null,null,"11:30:00",43,null,null,{"$f":"'TAB24 POULE'!K52","v":""},null,{"$f":"'TAB24 POULE'!K55","v":""},null,44,null,null,{"$f":"'TAB24 POULE'!K60","v":""},null,{"$f":"'TAB24 POULE'!K63","v":""},null,"2*15, SD 11"]
[null,null,null,"12:20:00","1/4 M1",45,null,{"$f":"'TAB24 POULE'!M14","v":""},null,{"$f":"'TAB24 POULE'!M23","v":""},null,"1/4 M2",46,null,{"$f":"'TAB24 POULE'!M27","v":""},null,{"$f":"'TAB24 POULE'!M36","v":""},null,"2*21, SD 15"]
[null,null,null,"13:10:00","1/4 M3",47,null,{"$f":"'TAB24 POULE'!M40","v":""},null,{"$f":"'TAB24 POULE'!M49","v":""},null,"1/4 M4",48,null,{"$f":"'TAB24 POULE'!M53","v":""},null,{"$f":"'TAB24 POULE'!M62","v":""},null,"2*21, SD 15"]
[null,null,null,"14:00:00","DEMI",49,null,{"$f":"'TAB24 POULE'!O18","v":""},null,{"$f":"'TAB24 POULE'!O32","v":""},null,null,null,null,null,null,null,null,"2*21, SD 15"]
[null,null,null,"14:50:00","DEMI",50,null,{"$f":"'TAB24 POULE'!O44","v":""},null,{"$f":"'TAB24 POULE'!O58","v":""},null,null,null,null,null,null,null,null,"2*21, SD 15"]
[null,null,null,"15:40:00"]
[null,null,null,"16:30:00","PETITE FINALE",51,null,{"$f":"'TAB24 POULE'!Q64","v":""},null,{"$f":"'TAB24 POULE'!Q69","v":""},null,null,null,null,null,null,null,null,"2*21, SD 15"]
[null,null,null,"17:20:00","FINALE",52,null,{"$f":"'TAB24 POULE'!Q24","v":""},null,{"$f":"'TAB24 POULE'!Q52","v":""},null,null,null,null,null,null,null,null,"2*21, SD 15"]
[null,null,null,"18:10:00","PODIUM"]

{"sheet":"SCORE 24 PRINC","index":8,"n_rows":59,"n_cols":36,"rows_kept":59,"cut":false,"hidden":false,"merged":[]}
[null,null,null,null,null,"TABLEAU DE SAISIE DE RESULTATS"]
[]
["DEBUT J1","09:00:00",null,null,null,"Saisir le résultats des sets dans les cases bordurées et colorées uniquement"]
["TEMPS","00:30:00"]
["DEBUT J2","09:00:00"]
[]
[null,null,"PHASE","JOUR","N° MATCH","HEURE","TER","EQ1",null,"EQ2","SCORE EQ1",null,"SCORE EQ2","SET 1 EQ1","SET 1 EQ2","SET 2 EQ1","SET 2 EQ2","SET 3 EQ1","SET 3 EQ2","POS 1","POS 2",null,null,null,null,"PTS","S+","S-","P+","P-","CS","CP","CL.I","RG",null,"CLA"]
[null,null,"A",1,1,{"$f":"B3","v":"09:00:00"},1,{"$f":"'TAB24 POULE'!C14","v":"T / 1"},"/",{"$f":"'TAB24 POULE'!C17","v":"T / 24"},{"$f":"SUM(IF(N8>O8,1,0),IF(P8>Q8,1,0),IF(R8>S8,1,0))","v":0},"/",{"$f":"SUM(IF(O8>N8,1,0),IF(Q8>P8,1,0),IF(S8>R8,1,0))","v":0},null,null,null,null,null,null,{"$f":"IF(K8=M8,\"\",IF(K8>M8,H8,J8))","v":""},{"$f":"IF(K8=M8,\"\",IF(K8<M8,H8,J8))","v":""},null,null,"A",{"$f":"'TAB24 POULE'!C14","v":"T / 1"},{"$f":"COUNTIF(PLACE1,Y8)*2+COUNTIF(PLACE2,Y8)","v":0},{"$f":"SUMIF(LISTEE1,Y8,(SCEQ1))+SUMIF(LISTEE2,Y8,(SCEQ2))","v":0},{"$f":"SUMIF(LISTEE1,Y8,(SCEQ2))+SUMIF(LISTEE2,Y8,(SCEQ1))","v":0},{"$f":"(SUMPRODUCT((LISTEE1=Y8)*((S1EQ1)+(S2EQ1)+(S3EQ1))))+(SUMPRODUCT((LISTEE2=Y8)*((S1EQ2)+(S2EQ2)+(S3EQ3))))","v":0},{"$f":"(SUMPRODUCT((LISTEE2=Y8)*((S1EQ1)+(S2EQ1)+(S3EQ1))))+(SUMPRODUCT((LISTEE1=Y8)*((S1EQ2)+(S2EQ2)+(S3EQ3))))","v":0},{"$f":"IFERROR(AA8/AB8,0)","v":0},{"$f":"IFERROR(AC8/AD8,0)","v":0},{"$f":"Z8+AE8/100+AF8/100","v":0},{"$f":"IF(Z8=0,\"\",RANK(AG8,$AG$8:$AG$11))","v":""},1,{"$f":"IF(Z8=0,\"\",IF($AH$8=AI8,$Y$8,IF($AH$9=AI8,$Y$9,IF($AH$10=AI8,$Y$10,IF($AH$11=AI8,$Y$11)))))","v":""}]
[null,null,"B",1,2,{"$f":"B3","v":"09:00:00"},2,{"$f":"'TAB24 POULE'!C21","v":"T / 2"},"/",{"$f":"'TAB24 POULE'!C24","v":"T / 23"},{"$f":"SUM(IF(N9>O9,1,0),IF(P9>Q9,1,0),IF(R9>S9,1,0))","v":0},"/",{"$f":"SUM(IF(O9>N9,1,0),IF(Q9>P9,1,0),IF(S9>R9,1,0))","v":0},null,null,null,null,null,null,{"$f":"IF(K9=M9,\"\",IF(K9>M9,H9,J9))","v":""},{"$f":"IF(K9=M9,\"\",IF(K9<M9,H9,J9))","v":""},null,null,null,{"$f":"'TAB24 POULE'!C15","v":"T / 12"},{"$f":"COUNTIF(PLACE1,Y9)*2+COUNTIF(PLACE2,Y9)","v":0},{"$f":"SUMIF(LISTEE1,Y9,(SCEQ1))+SUMIF(LISTEE2,Y9,(SCEQ2))","v":0},{"$f":"SUMIF(LISTEE1,Y9,(SCEQ2))+SUMIF(LISTEE2,Y9,(SCEQ1))","v":0},{"$f":"(SUMPRODUCT((LISTEE1=Y9)*((S1EQ1)+(S2EQ1)+(S3EQ1))))+(SUMPRODUCT((LISTEE2=Y9)*((S1EQ2)+(S2EQ2)+(S3EQ3))))","v":0},{"$f":"(SUMPRODUCT((LISTEE2=Y9)*((S1EQ1)+(S2EQ1)+(S3EQ1))))+(SUMPRODUCT((LISTEE1=Y9)*((S1EQ2)+(S2EQ2)+(S3EQ3))))","v":0},{"$f":"IFERROR(AA9/AB9,0)","v":0},{"$f":"IFERROR(AC9/AD9,0)","v":0},{"$f":"Z9+AE9/100+AF9/100","v":0},{"$f":"IF(Z9=0,\"\",RANK(AG9,$AG$8:$AG$11))","v":""},2,{"$f":"IF(Z9=0,\"\",IF($AH$8=AI9,$Y$8,IF($AH$9=AI9,$Y$9,IF($AH$10=AI9,$Y$10,IF($AH$11=AI9,$Y$11)))))","v":""}]
[null,null,"C",1,3,{"$f":"F8+$B$4","v":"09:30:00"},1,{"$f":"'TAB24 POULE'!C28","v":"T / 3"},"/",{"$f":"'TAB24 POULE'!C31","v":"T / 22"},0,"/",0,null,null,null,null,null,null,"","",null,null,null,{"$f":"'TAB24 POULE'!C16","v":"T / 13"},{"$f":"COUNTIF(PLACE1,Y10)*2+COUNTIF(PLACE2,Y10)","v":0},{"$f":"SUMIF(LISTEE1,Y10,(SCEQ1))+SUMIF(LISTEE2,Y10,(SCEQ2))","v":0},{"$f":"SUMIF(LISTEE1,Y10,SCEQ2)+SUMIF(LISTEE2,Y10,SCEQ1)","v":0},{"$f":"(SUMPRODUCT((LISTEE1=Y10)*((S1EQ1)+(S2EQ1)+(S3EQ1))))+(SUMPRODUCT((LISTEE2=Y10)*((S1EQ2)+(S2EQ2)+(S3EQ3))))","v":0},{"$f":"(SUMPRODUCT((LISTEE2=Y10)*((S1EQ1)+(S2EQ1)+(S3EQ1))))+(SUMPRODUCT((LISTEE1=Y10)*((S1EQ2)+(S2EQ2)+(S3EQ3))))","v":0},0,0,0,{"$f":"IF(Z10=0,\"\",RANK(AG10,$AG$8:$AG$11))","v":""},3,{"$f":"IF(Z10=0,\"\",IF($AH$8=AI10,$Y$8,IF($AH$9=AI10,$Y$9,IF($AH$10=AI10,$Y$10,IF($AH$11=AI10,$Y$11)))))","v":""}]
[null,null,"D",1,4,"09:30:00",2,{"$f":"'TAB24 POULE'!C35","v":"T / 4"},"/",{"$f":"'TAB24 POULE'!C38","v":"T / 21"},0,"/",0,null,null,null,null,null,null,"","",null,null,null,{"$f":"'TAB24 POULE'!C17","v":"T / 24"},{"$f":"COUNTIF(PLACE1,Y11)*2+COUNTIF(PLACE2,Y11)","v":0},{"$f":"SUMIF(LISTEE1,Y11,(SCEQ1))+SUMIF(LISTEE2,Y11,(SCEQ2))","v":0},{"$f":"SUMIF(LISTEE1,Y11,SCEQ2)+SUMIF(LISTEE2,Y11,SCEQ1)","v":0},{"$f":"(SUMPRODUCT((LISTEE1=Y11)*((S1EQ1)+(S2EQ1)+(S3EQ1))))+(SUMPRODUCT((LISTEE2=Y11)*((S1EQ2)+(S2EQ2)+(S3EQ3))))","v":0},{"$f":"(SUMPRODUCT((LISTEE2=Y11)*((S1EQ1)+(S2EQ1)+(S3EQ1))))+(SUMPRODUCT((LISTEE1=Y11)*((S1EQ2)+(S2EQ2)+(S3EQ3))))","v":0},0,0,0,{"$f":"IF(Z11=0,\"\",RANK(AG11,$AG$8:$AG$11))","v":""},4,{"$f":"IF(Z11=0,\"\",IF($AH$8=AI11,$Y$8,IF($AH$9=AI11,$Y$9,IF($AH$10=AI11,$Y$10,IF($AH$11=AI11,$Y$11)))))","v":""}]
[null,null,"E",1,5,"10:00:00",1,{"$f":"'TAB24 POULE'!C42","v":"T / 5"},"/",{"$f":"'TAB24 POULE'!C45","v":"T / 20"},0,"/",0,null,null,null,null,null,null,"",""]
[null,null,"F",1,6,"10:00:00",2,{"$f":"'TAB24 POULE'!C49","v":"T / 6"},"/",{"$f":"'TAB24 POULE'!C52","v":"T / 19"},0,"/",0,null,null,null,null,null,null,"","",null,null,"B",{"$f":"'TAB24 POULE'!C21","v":"T / 2"},{"$f":"COUNTIF(PLACE1,Y13)*2+COUNTIF(PLACE2,Y13)","v":0},{"$f":"SUMIF(LISTEE1,Y13,(SCEQ1))+SUMIF(LISTEE2,Y13,(SCEQ2))","v":0},{"$f":"SUMIF(LISTEE1,Y13,SCEQ2)+SUMIF(LISTEE2,Y13,SCEQ1)","v":0},{"$f":"(SUMPRODUCT((LISTEE1=Y13)*((S1EQ1)+(S2EQ1)+(S3EQ1))))+(SUMPRODUCT((LISTEE2=Y13)*((S1EQ2)+(S2EQ2)+(S3EQ3))))","v":0},{"$f":"(SUMPRODUCT((LISTEE2=Y13)*((S1EQ1)+(S2EQ1)+(S3EQ1))))+(SUMPRODUCT((LISTEE1=Y13)*((S1EQ2)+(S2EQ2)+(S3EQ3))))","v":0},0,0,0,{"$f":"IF(Z13=0,\"\",RANK(AG13,$AG$13:$AG$16))","v":""},1,{"$f":"IF(Z13=0,\"\",IF($AH$13=AI13,$Y$13,IF($AH$14=AI13,$Y$14,IF($AH$15=AI13,$Y$15,IF($AH$16=AI13,$Y$16)))))","v":""}]
[null,null,"A",1,7,"10:30:00",1,{"$f":"'TAB24 POULE'!C15","v":"T / 12"},"/",{"$f":"'TAB24 POULE'!C16","v":"T / 13"},{"$f":"SUM(IF(N14>O14,1,0),IF(P14>Q14,1,0),IF(R14>S14,1,0))","v":0},"/",0,null,null,null,null,null,null,{"$f":"IF(K14=M14,\"\",IF(K14>M14,H14,J14))","v":""},"",null,null,null,{"$f":"'TAB24 POULE'!C22","v":"T / 11"},{"$f":"COUNTIF(PLACE1,Y14)*2+COUNTIF(PLACE2,Y14)","v":0},{"$f":"SUMIF(LISTEE1,Y14,(SCEQ1))+SUMIF(LISTEE2,Y14,(SCEQ2))","v":0},{"$f":"SUMIF(LISTEE1,Y14,SCEQ2)+SUMIF(LISTEE2,Y14,SCEQ1)","v":0},{"$f":"(SUMPRODUCT((LISTEE1=Y14)*((S1EQ1)+(S2EQ1)+(S3EQ1))))+(SUMPRODUCT((LISTEE2=Y14)*((S1EQ2)+(S2EQ2)+(S3EQ3))))","v":0},{"$f":"(SUMPRODUCT((LISTEE2=Y14)*((S1EQ1)+(S2EQ1)+(S3EQ1))))+(SUMPRODUCT((LISTEE1=Y14)*((S1EQ2)+(S2EQ2)+(S3EQ3))))","v":0},0,0,0,{"$f":"IF(Z14=0,\"\",RANK(AG14,$AG$13:$AG$16))","v":""},2,{"$f":"IF(Z14=0,\"\",IF($AH$13=AI14,$Y$13,IF($AH$14=AI14,$Y$14,IF($AH$15=AI14,$Y$15,IF($AH$16=AI14,$Y$16)))))","v":""}]
[null,null,"B",1,8,"10:30:00",2,{"$f":"'TAB24 POULE'!C22","v":"T / 11"},"/",{"$f":"'TAB24 POULE'!C23","v":"T / 14"},0,"/",0,null,null,null,null,null,null,"","",null,null,null,{"$f":"'TAB24 POULE'!C23","v":"T / 14"},{"$f":"COUNTIF(PLACE1,Y15)*2+COUNTIF(PLACE2,Y15)","v":0},{"$f":"SUMIF(LISTEE1,Y15,(SCEQ1))+SUMIF(LISTEE2,Y15,(SCEQ2))","v":0},{"$f":"SUMIF(LISTEE1,Y15,SCEQ2)+SUMIF(LISTEE2,Y15,SCEQ1)","v":0},{"$f":"(SUMPRODUCT((LISTEE1=Y15)*((S1EQ1)+(S2EQ1)+(S3EQ1))))+(SUMPRODUCT((LISTEE2=Y15)*((S1EQ2)+(S2EQ2)+(S3EQ3))))","v":0},{"$f":"(SUMPRODUCT((LISTEE2=Y15)*((S1EQ1)+(S2EQ1)+(S3EQ1))))+(SUMPRODUCT((LISTEE1=Y15)*((S1EQ2)+(S2EQ2)+(S3EQ3))))","v":0},0,0,0,{"$f":"IF(Z15=0,\"\",RANK(AG15,$AG$13:$AG$16))","v":""},3,{"$f":"IF(Z15=0,\"\",IF($AH$13=AI15,$Y$13,IF($AH$14=AI15,$Y$14,IF($AH$15=AI15,$Y$15,IF($AH$16=AI15,$Y$16)))))","v":""}]
[null,null,"C",1,9,"11:00:00",1,{"$f":"'TAB24 POULE'!C29","v":"T / 10"},"/",{"$f":"'TAB24 POULE'!C30","v":"T / 15"},0,"/",0,null,null,null,null,null,null,"","",null,null,null,{"$f":"'TAB24 POULE'!C24","v":"T / 23"},{"$f":"COUNTIF(PLACE1,Y16)*2+COUNTIF(PLACE2,Y16)","v":0},{"$f":"SUMIF(LISTEE1,Y16,(SCEQ1))+SUMIF(LISTEE2,Y16,(SCEQ2))","v":0},{"$f":"SUMIF(LISTEE1,Y16,SCEQ2)+SUMIF(LISTEE2,Y16,SCEQ1)","v":0},{"$f":"(SUMPRODUCT((LISTEE1=Y16)*((S1EQ1)+(S2EQ1)+(S3EQ1))))+(SUMPRODUCT((LISTEE2=Y16)*((S1EQ2)+(S2EQ2)+(S3EQ3))))","v":0},{"$f":"(SUMPRODUCT((LISTEE2=Y16)*((S1EQ1)+(S2EQ1)+(S3EQ1))))+(SUMPRODUCT((LISTEE1=Y16)*((S1EQ2)+(S2EQ2)+(S3EQ3))))","v":0},0,0,0,{"$f":"IF(Z16=0,\"\",RANK(AG16,$AG$13:$AG$16))","v":""},4,{"$f":"IF(Z16=0,\"\",IF($AH$13=AI16,$Y$13,IF($AH$14=AI16,$Y$14,IF($AH$15=AI16,$Y$15,IF($AH$16=AI16,$Y$16)))))","v":""}]
[null,null,"D",1,10,"11:00:00",2,{"$f":"'TAB24 POULE'!C36","v":"T / 9"},"/",{"$f":"'TAB24 POULE'!C37","v":"T / 16"},0,"/",0,null,null,null,null,null,null,"",""]
[null,null,"E",1,11,"11:30:00",1,{"$f":"'TAB24 POULE'!C43","v":"T / 8"},"/",{"$f":"'TAB24 POULE'!C44","v":"T / 17"},0,"/",0,null,null,null,null,null,null,"","",null,null,"C",{"$f":"'TAB24 POULE'!C28","v":"T / 3"},{"$f":"COUNTIF(PLACE1,Y18)*2+COUNTIF(PLACE2,Y18)","v":0},{"$f":"SUMIF(LISTEE1,Y18,(SCEQ1))+SUMIF(LISTEE2,Y18,(SCEQ2))","v":0},{"$f":"SUMIF(LISTEE1,Y18,SCEQ2)+SUMIF(LISTEE2,Y18,SCEQ1)","v":0},{"$f":"(SUMPRODUCT((LISTEE1=Y18)*((S1EQ1)+(S2EQ1)+(S3EQ1))))+(SUMPRODUCT((LISTEE2=Y18)*((S1EQ2)+(S2EQ2)+(S3EQ3))))","v":0},{"$f":"(SUMPRODUCT((LISTEE2=Y18)*((S1EQ1)+(S2EQ1)+(S3EQ1))))+(SUMPRODUCT((LISTEE1=Y18)*((S1EQ2)+(S2EQ2)+(S3EQ3))))","v":0},{"$f":"IFERROR(AA18/AB18,0)","v":0},0,{"$f":"Z18+AE18/100+AF18/100","v":0},{"$f":"IF(Z18=0,\"\",RANK(AG18,$AG$18:$AG$21))","v":""},1,{"$f":"IF(Z18=0,\"\",IF($AH$18=AI18,$Y$18,IF($AH$19=AI18,$Y$19,IF($AH$20=AI18,$Y$20,IF($AH$21=AI18,$Y$21)))))","v":""}]
[null,null,"F",1,12,"11:30:00",2,{"$f":"'TAB24 POULE'!C50","v":"T / 7"},"/",{"$f":"'TAB24 POULE'!C51","v":"T / 18"},0,"/",0,null,null,null,null,null,null,"","",null,null,null,{"$f":"'TAB24 POULE'!C29","v":"T / 10"},{"$f":"COUNTIF(PLACE1,Y19)*2+COUNTIF(PLACE2,Y19)","v":0},{"$f":"SUMIF(LISTEE1,Y19,(SCEQ1))+SUMIF(LISTEE2,Y19,(SCEQ2))","v":0},{"$f":"SUMIF(LISTEE1,Y19,SCEQ2)+SUMIF(LISTEE2,Y19,SCEQ1)","v":0},{"$f":"(SUMPRODUCT((LISTEE1=Y19)*((S1EQ1)+(S2EQ1)+(S3EQ1))))+(SUMPRODUCT((LISTEE2=Y19)*((S1EQ2)+(S2EQ2)+(S3EQ3))))","v":0},{"$f":"(SUMPRODUCT((LISTEE2=Y19)*((S1EQ1)+(S2EQ1)+(S3EQ1))))+(SUMPRODUCT((LISTEE1=Y19)*((S1EQ2)+(S2EQ2)+(S3EQ3))))","v":0},0,0,{"$f":"Z19+AE19/100+AF19/100","v":0},{"$f":"IF(Z19=0,\"\",RANK(AG19,$AG$18:$AG$21))","v":""},2,{"$f":"IF(Z19=0,\"\",IF($AH$18=AI19,$Y$18,IF($AH$19=AI19,$Y$19,IF($AH$20=AI19,$Y$20,IF($AH$21=AI19,$Y$21)))))","v":""}]
[null,null,"A",1,13,"12:00:00",1,{"$f":"'TAB24 POULE'!C15","v":"T / 12"},"/",{"$f":"'TAB24 POULE'!C17","v":"T / 24"},0,"/",0,null,null,null,null,null,null,"","",null,null,null,{"$f":"'TAB24 POULE'!C30","v":"T / 15"},{"$f":"COUNTIF(PLACE1,Y20)*2+COUNTIF(PLACE2,Y20)","v":0},{"$f":"SUMIF(LISTEE1,Y20,(SCEQ1))+SUMIF(LISTEE2,Y20,(SCEQ2))","v":0},{"$f":"SUMIF(LISTEE1,Y20,SCEQ2)+SUMIF(LISTEE2,Y20,SCEQ1)","v":0},{"$f":"(SUMPRODUCT((LISTEE1=Y20)*((S1EQ1)+(S2EQ1)+(S3EQ1))))+(SUMPRODUCT((LISTEE2=Y20)*((S1EQ2)+(S2EQ2)+(S3EQ3))))","v":0},{"$f":"(SUMPRODUCT((LISTEE2=Y20)*((S1EQ1)+(S2EQ1)+(S3EQ1))))+(SUMPRODUCT((LISTEE1=Y20)*((S1EQ2)+(S2EQ2)+(S3EQ3))))","v":0},0,0,0,"",3,{"$f":"IF(Z20=0,\"\",IF($AH$18=AI20,$Y$18,IF($AH$19=AI20,$Y$19,IF($AH$20=AI20,$Y$20,IF($AH$21=AI20,$Y$21)))))","v":""}]
[null,null,"B",1,14,"12:00:00",2,{"$f":"'TAB24 POULE'!C22","v":"T / 11"},"/",{"$f":"'TAB24 POULE'!C24","v":"T / 23"},0,"/",0,null,null,null,null,null,null,"","",null,null,null,{"$f":"'TAB24 POULE'!C31","v":"T / 22"},{"$f":"COUNTIF(PLACE1,Y21)*2+COUNTIF(PLACE2,Y21)","v":0},{"$f":"SUMIF(LISTEE1,Y21,(SCEQ1))+SUMIF(LISTEE2,Y21,(SCEQ2))","v":0},{"$f":"SUMIF(LISTEE1,Y21,SCEQ2)+SUMIF(LISTEE2,Y21,SCEQ1)","v":0},{"$f":"(SUMPRODUCT((LISTEE1=Y21)*((S1EQ1)+(S2EQ1)+(S3EQ1))))+(SUMPRODUCT((LISTEE2=Y21)*((S1EQ2)+(S2EQ2)+(S3EQ3))))","v":0},{"$f":"(SUMPRODUCT((LISTEE2=Y21)*((S1EQ1)+(S2EQ1)+(S3EQ1))))+(SUMPRODUCT((LISTEE1=Y21)*((S1EQ2)+(S2EQ2)+(S3EQ3))))","v":0},0,0,{"$f":"Z21+AE21/100+AF21/100","v":0},"",4,{"$f":"IF(Z21=0,\"\",IF($AH$18=AI21,$Y$18,IF($AH$19=AI21,$Y$19,IF($AH$20=AI21,$Y$20,IF($AH$21=AI21,$Y$21)))))","v":""}]
[null,null,"C",1,15,"12:30:00",1,{"$f":"'TAB24 POULE'!C29","v":"T / 10"},"/",{"$f":"'TAB24 POULE'!C31","v":"T / 22"},0,"/",0,null,null,null,null,null,null,"",""]
[null,null,"D",1,16,"12:30:00",2,{"$f":"'TAB24 POULE'!C36","v":"T / 9"},"/",{"$f":"'TAB24 POULE'!C38","v":"T / 21"},0,"/",0,null,null,null,null,null,null,"","",null,null,"D",{"$f":"'TAB24 POULE'!C35","v":"T / 4"},{"$f":"COUNTIF(PLACE1,Y23)*2+COUNTIF(PLACE2,Y23)","v":0},{"$f":"SUMIF(LISTEE1,Y23,(SCEQ1))+SUMIF(LISTEE2,Y23,(SCEQ2))","v":0},{"$f":"SUMIF(LISTEE1,Y23,SCEQ2)+SUMIF(LISTEE2,Y23,SCEQ1)","v":0},{"$f":"(SUMPRODUCT((LISTEE1=Y23)*((S1EQ1)+(S2EQ1)+(S3EQ1))))+(SUMPRODUCT((LISTEE2=Y23)*((S1EQ2)+(S2EQ2)+(S3EQ3))))","v":0},{"$f":"(SUMPRODUCT((LISTEE2=Y23)*((S1EQ1)+(S2EQ1)+(S3EQ1))))+(SUMPRODUCT((LISTEE1=Y23)*((S1EQ2)+(S2EQ2)+(S3EQ3))))","v":0},0,0,0,{"$f":"IF(Z23=0,\"\",RANK(AG23,$AG$23:$AG$26))","v":""},1,{"$f":"IF(Z23=0,\"\",IF($AH$23=AI23,$Y$23,IF($AH$24=AI23,$Y$24,IF($AH$25=AI23,$Y$25,IF($AH$26=AI23,$Y$26)))))","v":""}]
[null,null,"E",1,17,"13:00:00",1,{"$f":"'TAB24 POULE'!C43","v":"T / 8"},"/",{"$f":"'TAB24 POULE'!C45","v":"T / 20"},0,"/",0,null,null,null,null,null,null,"","",null,null,null,{"$f":"'TAB24 POULE'!C36","v":"T / 9"},{"$f":"COUNTIF(PLACE1,Y24)*2+COUNTIF(PLACE2,Y24)","v":0},{"$f":"SUMIF(LISTEE1,Y24,(SCEQ1))+SUMIF(LISTEE2,Y24,(SCEQ2))","v":0},{"$f":"SUMIF(LISTEE1,Y24,SCEQ2)+SUMIF(LISTEE2,Y24,SCEQ1)","v":0},{"$f":"(SUMPRODUCT((LISTEE1=Y24)*((S1EQ1)+(S2EQ1)+(S3EQ1))))+(SUMPRODUCT((LISTEE2=Y24)*((S1EQ2)+(S2EQ2)+(S3EQ3))))","v":0},{"$f":"(SUMPRODUCT((LISTEE2=Y24)*((S1EQ1)+(S2EQ1)+(S3EQ1))))+(SUMPRODUCT((LISTEE1=Y24)*((S1EQ2)+(S2EQ2)+(S3EQ3))))","v":0},0,0,0,{"$f":"IF(Z24=0,\"\",RANK(AG24,$AG$23:$AG$26))","v":""},2,{"$f":"IF(Z24=0,\"\",IF($AH$23=AI24,$Y$23,IF($AH$24=AI24,$Y$24,IF($AH$25=AI24,$Y$25,IF($AH$26=AI24,$Y$26)))))","v":""}]
[null,null,"F",1,18,"13:00:00",2,{"$f":"'TAB24 POULE'!C50","v":"T / 7"},"/",{"$f":"'TAB24 POULE'!C52","v":"T / 19"},0,"/",0,null,null,null,null,null,null,"","",null,null,null,{"$f":"'TAB24 POULE'!C37","v":"T / 16"},{"$f":"COUNTIF(PLACE1,Y25)*2+COUNTIF(PLACE2,Y25)","v":0},{"$f":"SUMIF(LISTEE1,Y25,(SCEQ1))+SUMIF(LISTEE2,Y25,(SCEQ2))","v":0},{"$f":"SUMIF(LISTEE1,Y25,SCEQ2)+SUMIF(LISTEE2,Y25,SCEQ1)","v":0},{"$f":"(SUMPRODUCT((LISTEE1=Y25)*((S1EQ1)+(S2EQ1)+(S3EQ1))))+(SUMPRODUCT((LISTEE2=Y25)*((S1EQ2)+(S2EQ2)+(S3EQ3))))","v":0},{"$f":"(SUMPRODUCT((LISTEE2=Y25)*((S1EQ1)+(S2EQ1)+(S3EQ1))))+(SUMPRODUCT((LISTEE1=Y25)*((S1EQ2)+(S2EQ2)+(S3EQ3))))","v":0},0,0,0,"",3,""]
[null,null,"A",1,19,"13:30:00",1,{"$f":"'TAB24 POULE'!C14","v":"T / 1"},"/",{"$f":"'TAB24 POULE'!C16","v":"T / 13"},0,"/",0,null,null,null,null,null,null,"","",null,null,null,{"$f":"'TAB24 POULE'!C38","v":"T / 21"},{"$f":"COUNTIF(PLACE1,Y26)*2+COUNTIF(PLACE2,Y26)","v":0},{"$f":"SUMIF(LISTEE1,Y26,(SCEQ1))+SUMIF(LISTEE2,Y26,(SCEQ2))","v":0},{"$f":"SUMIF(LISTEE1,Y26,SCEQ2)+SUMIF(LISTEE2,Y26,SCEQ1)","v":0},{"$f":"(SUMPRODUCT((LISTEE1=Y26)*((S1EQ1)+(S2EQ1)+(S3EQ1))))+(SUMPRODUCT((LISTEE2=Y26)*((S1EQ2)+(S2EQ2)+(S3EQ3))))","v":0},{"$f":"(SUMPRODUCT((LISTEE2=Y26)*((S1EQ1)+(S2EQ1)+(S3EQ1))))+(SUMPRODUCT((LISTEE1=Y26)*((S1EQ2)+(S2EQ2)+(S3EQ3))))","v":0},0,0,0,"",4,{"$f":"IF(Z26=0,\"\",IF($AH$23=AI26,$Y$23,IF($AH$24=AI26,$Y$24,IF($AH$25=AI26,$Y$25,IF($AH$26=AI26,$Y$26)))))","v":""}]
[null,null,"B",1,20,"13:30:00",2,{"$f":"'TAB24 POULE'!C21","v":"T / 2"},"/",{"$f":"'TAB24 POULE'!C23","v":"T / 14"},0,"/",0,null,null,null,null,null,null,"",""]
[null,null,"C",1,21,"14:00:00",1,{"$f":"'TAB24 POULE'!C28","v":"T / 3"},"/",{"$f":"'TAB24 POULE'!C30","v":"T / 15"},0,"/",0,null,null,null,null,null,null,"","",null,null,"E",{"$f":"'TAB24 POULE'!C42","v":"T / 5"},{"$f":"COUNTIF(PLACE1,Y28)*2+COUNTIF(PLACE2,Y28)","v":0},{"$f":"SUMIF(LISTEE1,Y28,(SCEQ1))+SUMIF(LISTEE2,Y28,(SCEQ2))","v":0},{"$f":"SUMIF(LISTEE1,Y28,SCEQ2)+SUMIF(LISTEE2,Y28,SCEQ1)","v":0},{"$f":"(SUMPRODUCT((LISTEE1=Y28)*((S1EQ1)+(S2EQ1)+(S3EQ1))))+(SUMPRODUCT((LISTEE2=Y28)*((S1EQ2)+(S2EQ2)+(S3EQ3))))","v":0},{"$f":"(SUMPRODUCT((LISTEE2=Y28)*((S1EQ1)+(S2EQ1)+(S3EQ1))))+(SUMPRODUCT((LISTEE1=Y28)*((S1EQ2)+(S2EQ2)+(S3EQ3))))","v":0},{"$f":"IFERROR(AA28/AB28,0)","v":0},0,{"$f":"Z28+AE28/100+AF28/100","v":0},{"$f":"IF(Z28=0,\"\",RANK(AG28,$AG$28:$AG$31))","v":""},1,{"$f":"IF(Z28=0,\"\",IF($AH$28=AI28,$Y$28,IF($AH$29=AI28,$Y$29,IF($AH$30=AI28,$Y$30,IF($AH$31=AI28,$Y$31)))))","v":""}]
[null,null,"D",1,22,"14:00:00",2,{"$f":"'TAB24 POULE'!C35","v":"T / 4"},"/",{"$f":"'TAB24 POULE'!C37","v":"T / 16"},0,"/",0,null,null,null,null,null,null,"","",null,null,null,{"$f":"'TAB24 POULE'!C43","v":"T / 8"},{"$f":"COUNTIF(PLACE1,Y29)*2+COUNTIF(PLACE2,Y29)","v":0},{"$f":"SUMIF(LISTEE1,Y29,(SCEQ1))+SUMIF(LISTEE2,Y29,(SCEQ2))","v":0},{"$f":"SUMIF(LISTEE1,Y29,SCEQ2)+SUMIF(LISTEE2,Y29,SCEQ1)","v":0},{"$f":"(SUMPRODUCT((LISTEE1=Y29)*((S1EQ1)+(S2EQ1)+(S3EQ1))))+(SUMPRODUCT((LISTEE2=Y29)*((S1EQ2)+(S2EQ2)+(S3EQ3))))","v":0},{"$f":"(SUMPRODUCT((LISTEE2=Y29)*((S1EQ1)+(S2EQ1)+(S3EQ1))))+(SUMPRODUCT((LISTEE1=Y29)*((S1EQ2)+(S2EQ2)+(S3EQ3))))","v":0},{"$f":"IFERROR(AA29/AB29,0)","v":0},0,{"$f":"Z29+AE29/100+AF29/100","v":0},{"$f":"IF(Z29=0,\"\",RANK(AG29,$AG$28:$AG$31))","v":""},2,{"$f":"IF(Z29=0,\"\",IF($AH$28=AI29,$Y$28,IF($AH$29=AI29,$Y$29,IF($AH$30=AI29,$Y$30,IF($AH$31=AI29,$Y$31)))))","v":""}]
[null,null,"E",1,23,"14:30:00",1,{"$f":"'TAB24 POULE'!C42","v":"T / 5"},"/",{"$f":"'TAB24 POULE'!C44","v":"T / 17"},0,"/",0,null,null,null,null,null,null,"","",null,null,null,{"$f":"'TAB24 POULE'!C44","v":"T / 17"},{"$f":"COUNTIF(PLACE1,Y30)*2+COUNTIF(PLACE2,Y30)","v":0},{"$f":"SUMIF(LISTEE1,Y30,(SCEQ1))+SUMIF(LISTEE2,Y30,(SCEQ2))","v":0},{"$f":"SUMIF(LISTEE1,Y30,SCEQ2)+SUMIF(LISTEE2,Y30,SCEQ1)","v":0},{"$f":"(SUMPRODUCT((LISTEE1=Y30)*((S1EQ1)+(S2EQ1)+(S3EQ1))))+(SUMPRODUCT((LISTEE2=Y30)*((S1EQ2)+(S2EQ2)+(S3EQ3))))","v":0},{"$f":"(SUMPRODUCT((LISTEE2=Y30)*((S1EQ1)+(S2EQ1)+(S3EQ1))))+(SUMPRODUCT((LISTEE1=Y30)*((S1EQ2)+(S2EQ2)+(S3EQ3))))","v":0},0,0,0,"",3,{"$f":"IF(Z30=0,\"\",IF($AH$28=AI30,$Y$28,IF($AH$29=AI30,$Y$29,IF($AH$30=AI30,$Y$30,IF($AH$31=AI30,$Y$31)))))","v":""}]
[null,null,"F",1,24,"14:30:00",2,{"$f":"'TAB24 POULE'!C49","v":"T / 6"},"/",{"$f":"'TAB24 POULE'!C51","v":"T / 18"},0,"/",0,null,null,null,null,null,null,{"$f":"IF(K31=M31,\"\",IF(K31>M31,H31,J31))","v":""},"",null,null,null,{"$f":"'TAB24 POULE'!C45","v":"T / 20"},{"$f":"COUNTIF(PLACE1,Y31)*2+COUNTIF(PLACE2,Y31)","v":0},{"$f":"SUMIF(LISTEE1,Y31,(SCEQ1))+SUMIF(LISTEE2,Y31,(SCEQ2))","v":0},{"$f":"SUMIF(LISTEE1,Y31,SCEQ2)+SUMIF(LISTEE2,Y31,SCEQ1)","v":0},{"$f":"(SUMPRODUCT((LISTEE1=Y31)*((S1EQ1)+(S2EQ1)+(S3EQ1))))+(SUMPRODUCT((LISTEE2=Y31)*((S1EQ2)+(S2EQ2)+(S3EQ3))))","v":0},{"$f":"(SUMPRODUCT((LISTEE2=Y31)*((S1EQ1)+(S2EQ1)+(S3EQ1))))+(SUMPRODUCT((LISTEE1=Y31)*((S1EQ2)+(S2EQ2)+(S3EQ3))))","v":0},0,0,0,"",4,{"$f":"IF(Z31=0,\"\",IF($AH$28=AI31,$Y$28,IF($AH$29=AI31,$Y$29,IF($AH$30=AI31,$Y$30,IF($AH$31=AI31,$Y$31)))))","v":""}]
[null,null,"A",1,25,"15:00:00",1,{"$f":"'TAB24 POULE'!C16","v":"T / 13"},"/",{"$f":"'TAB24 POULE'!C17","v":"T / 24"},0,"/",0,null,null,null,null,null,null,{"$f":"IF(K32=M32,\"\",IF(K32>M32,H32,J32))","v":""},""]
[null,null,"B",1,26,"15:00:00",2,{"$f":"'TAB24 POULE'!C23","v":"T / 14"},"/",{"$f":"'TAB24 POULE'!C24","v":"T / 23"},0,"/",0,null,null,null,null,null,null,{"$f":"IF(K33=M33,\"\",IF(K33>M33,H33,J33))","v":""},"",null,null,"F",{"$f":"'TAB24 POULE'!C49","v":"T / 6"},{"$f":"COUNTIF(PLACE1,Y33)*2+COUNTIF(PLACE2,Y33)","v":0},{"$f":"SUMIF(LISTEE1,Y33,(SCEQ1))+SUMIF(LISTEE2,Y33,(SCEQ2))","v":0},{"$f":"SUMIF(LISTEE1,Y33,SCEQ2)+SUMIF(LISTEE2,Y33,SCEQ1)","v":0},{"$f":"(SUMPRODUCT((LISTEE1=Y33)*((S1EQ1)+(S2EQ1)+(S3EQ1))))+(SUMPRODUCT((LISTEE2=Y33)*((S1EQ2)+(S2EQ2)+(S3EQ3))))","v":0},{"$f":"(SUMPRODUCT((LISTEE2=Y33)*((S1EQ1)+(S2EQ1)+(S3EQ1))))+(SUMPRODUCT((LISTEE1=Y33)*((S1EQ2)+(S2EQ2)+(S3EQ3))))","v":0},{"$f":"IFERROR(AA33/AB33,0)","v":0},0,{"$f":"Z33+AE33/100+AF33/100","v":0},{"$f":"IF(Z33=0,\"\",RANK(AG33,$AG$33:$AG$36))","v":""},1,{"$f":"IF(Z33=0,\"\",IF($AH$33=AI33,$Y$33,IF($AH$34=AI33,$Y$34,IF($AH$35=AI33,$Y$35,IF($AH$36=AI33,$Y$36)))))","v":""}]
[null,null,"C",1,27,"15:30:00",1,{"$f":"'TAB24 POULE'!C30","v":"T / 15"},"/",{"$f":"'TAB24 POULE'!C31","v":"T / 22"},0,"/",0,null,null,null,null,null,null,"","",null,null,null,{"$f":"'TAB24 POULE'!C50","v":"T / 7"},{"$f":"COUNTIF(PLACE1,Y34)*2+COUNTIF(PLACE2,Y34)","v":0},{"$f":"SUMIF(LISTEE1,Y34,(SCEQ1))+SUMIF(LISTEE2,Y34,(SCEQ2))","v":0},{"$f":"SUMIF(LISTEE1,Y34,SCEQ2)+SUMIF(LISTEE2,Y34,SCEQ1)","v":0},{"$f":"(SUMPRODUCT((LISTEE1=Y34)*((S1EQ1)+(S2EQ1)+(S3EQ1))))+(SUMPRODUCT((LISTEE2=Y34)*((S1EQ2)+(S2EQ2)+(S3EQ3))))","v":0},{"$f":"(SUMPRODUCT((LISTEE2=Y34)*((S1EQ1)+(S2EQ1)+(S3EQ1))))+(SUMPRODUCT((LISTEE1=Y34)*((S1EQ2)+(S2EQ2)+(S3EQ3))))","v":0},{"$f":"IFERROR(AA34/AB34,0)","v":0},0,{"$f":"Z34+AE34/100+AF34/100","v":0},{"$f":"IF(Z34=0,\"\",RANK(AG34,$AG$33:$AG$36))","v":""},2,{"$f":"IF(Z34=0,\"\",IF($AH$33=AI34,$Y$33,IF($AH$34=AI34,$Y$34,IF($AH$35=AI34,$Y$35,IF($AH$36=AI34,$Y$36)))))","v":""}]
[null,null,"D",1,28,"15:30:00",2,{"$f":"'TAB24 POULE'!C37","v":"T / 16"},"/",{"$f":"'TAB24 POULE'!C38","v":"T / 21"},0,"/",0,null,null,null,null,null,null,"","",null,null,null,{"$f":"'TAB24 POULE'!C51","v":"T / 18"},{"$f":"COUNTIF(PLACE1,Y35)*2+COUNTIF(PLACE2,Y35)","v":0},{"$f":"SUMIF(LISTEE1,Y35,(SCEQ1))+SUMIF(LISTEE2,Y35,(SCEQ2))","v":0},{"$f":"SUMIF(LISTEE1,Y35,SCEQ2)+SUMIF(LISTEE2,Y35,SCEQ1)","v":0},{"$f":"(SUMPRODUCT((LISTEE1=Y35)*((S1EQ1)+(S2EQ1)+(S3EQ1))))+(SUMPRODUCT((LISTEE2=Y35)*((S1EQ2)+(S2EQ2)+(S3EQ3))))","v":0},{"$f":"(SUMPRODUCT((LISTEE2=Y35)*((S1EQ1)+(S2EQ1)+(S3EQ1))))+(SUMPRODUCT((LISTEE1=Y35)*((S1EQ2)+(S2EQ2)+(S3EQ3))))","v":0},0,0,0,"",3,""]
[null,null,"E",1,29,"16:00:00",1,{"$f":"'TAB24 POULE'!C44","v":"T / 17"},"/",{"$f":"'TAB24 POULE'!C45","v":"T / 20"},0,"/",0,null,null,null,null,null,null,"","",null,null,null,{"$f":"'TAB24 POULE'!C52","v":"T / 19"},{"$f":"COUNTIF(PLACE1,Y36)*2+COUNTIF(PLACE2,Y36)","v":0},{"$f":"SUMIF(LISTEE1,Y36,(SCEQ1))+SUMIF(LISTEE2,Y36,(SCEQ2))","v":0},{"$f":"SUMIF(LISTEE1,Y36,SCEQ2)+SUMIF(LISTEE2,Y36,SCEQ1)","v":0},{"$f":"(SUMPRODUCT((LISTEE1=Y36)*((S1EQ1)+(S2EQ1)+(S3EQ1))))+(SUMPRODUCT((LISTEE2=Y36)*((S1EQ2)+(S2EQ2)+(S3EQ3))))","v":0},{"$f":"(SUMPRODUCT((LISTEE2=Y36)*((S1EQ1)+(S2EQ1)+(S3EQ1))))+(SUMPRODUCT((LISTEE1=Y36)*((S1EQ2)+(S2EQ2)+(S3EQ3))))","v":0},0,0,0,"",4,{"$f":"IF(Z36=0,\"\",IF($AH$33=AI36,$Y$33,IF($AH$34=AI36,$Y$34,IF($AH$35=AI36,$Y$35,IF($AH$36=AI36,$Y$36)))))","v":""}]
[null,null,"F",1,30,"16:00:00",2,{"$f":"'TAB24 POULE'!C51","v":"T / 18"},"/",{"$f":"'TAB24 POULE'!C52","v":"T / 19"},0,"/",0,null,null,null,null,null,null,"",""]
[null,null,"A",1,31,"16:30:00",1,{"$f":"'TAB24 POULE'!C14","v":"T / 1"},"/",{"$f":"'TAB24 POULE'!C15","v":"T / 12"},0,"/",0,null,null,null,null,null,null,"",""]
[null,null,"B",1,32,"16:30:00",2,{"$f":"'TAB24 POULE'!C21","v":"T / 2"},"/",{"$f":"'TAB24 POULE'!C22","v":"T / 11"},0,"/",0,null,null,null,null,null,null,"",""]
[null,null,"C",1,33,"17:00:00",1,{"$f":"'TAB24 POULE'!C28","v":"T / 3"},"/",{"$f":"'TAB24 POULE'!C29","v":"T / 10"},0,"/",0,null,null,null,null,null,null,"",""]
[null,null,"D",1,34,{"$f":"F40+$B$4","v":"17:30:00"},2,{"$f":"'TAB24 POULE'!C35","v":"T / 4"},"/",{"$f":"'TAB24 POULE'!C36","v":"T / 9"},0,"/",0,null,null,null,null,null,null,"",""]
[null,null,"E",1,35,{"$f":"F41+$B$4","v":"18:00:00"},1,{"$f":"'TAB24 POULE'!C42","v":"T / 5"},"/",{"$f":"'TAB24 POULE'!C43","v":"T / 8"},0,"/",0,null,null,null,null,null,null,"",""]
[null,null,"F",1,36,{"$f":"F42+$B$4","v":"18:30:00"},2,{"$f":"'TAB24 POULE'!C49","v":"T / 6"},"/",{"$f":"'TAB24 POULE'!C50","v":"T / 7"},0,"/",0,null,null,null,null,null,null,"",""]
[null,null,"1/8",null,37,{"$f":"B5","v":"09:00:00"},null,{"$f":"AJ8","v":""},"/",null,0,"/",0,null,null,null,null,null,null,"",""]
[null,null,"1/8",null,38,{"$f":"B5","v":"09:00:00"},null,{"$f":"AJ14","v":""},"/",{"$f":"AJ34","v":""},0,"/",0,null,null,null,null,null,null,"",""]
[null,null,"1/8",null,39,{"$f":"F44+B4","v":"09:30:00"},null,{"$f":"AJ19","v":""},"/",{"$f":"AJ28","v":""},0,"/",0,null,null,null,null,null,null,"",""]
[null,null,"1/8",null,40,{"$f":"F45+B4","v":"09:30:00"},null,{"$f":"AJ23","v":""},"/",null,0,"/",0,null,null,null,null,null,null,"",""]
[null,null,"1/8",null,41,{"$f":"F46+B4","v":"10:00:00"},null,{"$f":"AJ18","v":""},"/",null,0,"/",0,null,null,null,null,null,null,"",""]
[null,null,"1/8",null,42,{"$f":"F46+B4","v":"10:00:00"},null,{"$f":"AJ29","v":""},"/",{"$f":"AJ33","v":""},0,"/",0,null,null,null,null,null,null,"",""]
[null,null,"1/8",null,43,{"$f":"F48+B4","v":"10:30:00"},null,{"$f":"AJ9","v":""},"/",{"$f":"AJ24","v":""},0,"/",0,null,null,null,null,null,null,"",""]
[null,null,"1/8",null,44,{"$f":"F49+B4","v":"10:30:00"},null,{"$f":"AJ13","v":""},"/",null,0,"/",0,null,null,null,null,null,null,"",""]
[null,null,"1/4",null,45,{"$f":"F50+B4","v":"11:00:00"},null,{"$f":"T44","v":""},"/",{"$f":"T45","v":""},0,"/",0,null,null,null,null,null,null,"",""]
[null,null,"1/4",null,46,{"$f":"F50+B4","v":"11:00:00"},null,{"$f":"T47","v":""},"/",{"$f":"T46","v":""},0,"/",0,null,null,null,null,null,null,"",""]
[null,null,"1/4",null,47,{"$f":"F52+B4","v":"11:30:00"},null,{"$f":"T48","v":""},"/",{"$f":"T49","v":""},0,"/",0,null,null,null,null,null,null,"",""]
[null,null,"1/4",null,48,{"$f":"F53+B4","v":"11:30:00"},null,{"$f":"T51","v":""},"/",{"$f":"T50","v":""},0,"/",0,null,null,null,null,null,null,"",""]
[null,null,"1/2",null,49,null,null,{"$f":"T52","v":""},"/",{"$f":"T53","v":""},0,"/",0,null,null,null,null,null,null,"",""]
[null,null,"1/2",null,50,null,null,{"$f":"T55","v":""},"/",{"$f":"T54","v":""},0,"/",0,null,null,null,null,null,null,"",""]
[null,null,"PF",null,51,null,null,{"$f":"U56","v":""},"/",{"$f":"U57","v":""},0,"/",0,null,null,null,null,null,null,"",""]
[null,null,"F",null,52,null,null,{"$f":"T56","v":""},"/",{"$f":"T57","v":""},0,"/",0,null,null,null,null,null,null,"",""]

{"sheet":"TAB24 POULE","index":9,"n_rows":69,"n_cols":18,"rows_kept":69,"cut":false,"hidden":false,"merged":[[4,5,4,14],[5,5,5,14],[0,5,2,12],[3,5,3,8],[3,9,3,10],[3,11,3,12],[0,13,3,14]]}
[null,null,null,null,null,{"$f":"IF('LISTE ENGAGES'!R3=\"\",'LISTE ENGAGES'!Q3,'LISTE ENGAGES'!R3)","v":"APPELATION TOURNOI"},null,null,null,null,null,null,null,{"$f":"IF('LISTE ENGAGES'!R10=\"\",'LISTE ENGAGES'!Q10,'LISTE ENGAGES'!R10)","v":"ORGANISATEUR"}]
[]
[]
[null,null,null,null,null,{"$f":"IF('LISTE ENGAGES'!R4=\"\",'LISTE ENGAGES'!Q4,'LISTE ENGAGES'!R4)","v":"LIEU"},null,null,null,{"$f":"IF('LISTE ENGAGES'!R6=\"\",\"DATE\",CONCATENATE('LISTE ENGAGES'!R7,\"-\",'LISTE ENGAGES'!R8,\"/\",'LISTE ENGAGES'!R6))","v":"DATE"},null,{"$f":"IF('LISTE ENGAGES'!R9=\"\",'LISTE ENGAGES'!Q9,'LISTE ENGAGES'!R9)","v":"GENRE"}]
[null,null,null,null,null,{"$f":"IF('LISTE ENGAGES'!R5=\"\",'LISTE ENGAGES'!Q5,'LISTE ENGAGES'!R5)","v":"TYPE"}]
[null,null,null,null,null,"TABLEAU PRINCIPAL"]
[]
[]
[]
[null,null,"POULES",null,null,"RESULTAS",null,"CLASS. POULE",null,null,"1/8",null,"1/4 FINALES",null,"1/2 FINALES",null,"FINALE"]
[]
[]
[null,null,null,{"$f":"CONCATENATE(B14,\"/\",B17)","v":"T1/T24"},"(1)",{"$f":"IF('SCORE 24 PRINC'!K8='SCORE 24 PRINC'!M8,\"\",CONCATENATE('SCORE 24 PRINC'!K8,\" / \",'SCORE 24 PRINC'!M8,\"   (\",'SCORE 24 PRINC'!N8,\" : \",'SCORE 24 PRINC'!O8,\")\",\" (\",'SCORE 24 PRINC'!P8,\" : \",'SCORE 24 PRINC'!Q8,\")\",\" (\",'SCORE 24 PRINC'!R8,\" : \",'SCORE 24 PRINC'!S8,\")\"))","v":""},1,{"$f":"IF('SCORE 24 PRINC'!AJ8=\"\",\"\",'SCORE 24 PRINC'!AJ8)","v":""},null,null,{"$f":"H13","v":""}]
[null,"T1",{"$f":"CONCATENATE('EMARG M Tableau PRIN'!C9,\" / \",'EMARG M Tableau PRIN'!E9)","v":"T / 1"},{"$f":"CONCATENATE(B15,\"/\",B16)","v":"T12/T13"},"(7)",{"$f":"IF('SCORE 24 PRINC'!K14='SCORE 24 PRINC'!M14,\"\",CONCATENATE('SCORE 24 PRINC'!K14,\" / \",'SCORE 24 PRINC'!M14,\"   (\",'SCORE 24 PRINC'!N14,\" : \",'SCORE 24 PRINC'!O14,\")\",\" (\",'SCORE 24 PRINC'!P14,\" : \",'SCORE 24 PRINC'!Q14,\")\",\" (\",'SCORE 24 PRINC'!R14,\" : \",'SCORE 24 PRINC'!S14,\")\"))","v":""},2,{"$f":"IF('SCORE 24 PRINC'!AJ9=\"\",\"\",'SCORE 24 PRINC'!AJ9)","v":""},null,null,"1A",null,{"$f":"'SCORE 24 PRINC'!T44","v":""}]
["A","T12",{"$f":"CONCATENATE('EMARG M Tableau PRIN'!C20,\" / \",'EMARG M Tableau PRIN'!E20)","v":"T / 12"},{"$f":"CONCATENATE(B15,\"/\",B17)","v":"T12/T24"},"(13)",{"$f":"IF('SCORE 24 PRINC'!K20='SCORE 24 PRINC'!M20,\"\",CONCATENATE('SCORE 24 PRINC'!K20,\" / \",'SCORE 24 PRINC'!M20,\"   (\",'SCORE 24 PRINC'!N20,\" : \",'SCORE 24 PRINC'!O20,\")\",\" (\",'SCORE 24 PRINC'!P20,\" : \",'SCORE 24 PRINC'!Q20,\")\",\" (\",'SCORE 24 PRINC'!R20,\" : \",'SCORE 24 PRINC'!S20,\")\"))","v":""},3,{"$f":"IF('SCORE 24 PRINC'!AJ10=\"\",\"\",'SCORE 24 PRINC'!AJ10)","v":""},null,null,"3(B,C,D,E,F)               (37)",null,{"$f":"IF('SCORE 24 PRINC'!K44='SCORE 24 PRINC'!M44,\"\",CONCATENATE('SCORE 24 PRINC'!K44,\" / \",'SCORE 24 PRINC'!M44,\"   (\",'SCORE 24 PRINC'!N44,\" : \",'SCORE 24 PRINC'!O44,\")\",\" (\",'SCORE 24 PRINC'!P44,\" : \",'SCORE 24 PRINC'!Q44,\")\",\" (\",'SCORE 24 PRINC'!R44,\" : \",'SCORE 24 PRINC'!S44,\")\"))","v":""}]
[null,"T13",{"$f":"CONCATENATE('EMARG M Tableau PRIN'!C21,\" / \",'EMARG M Tableau PRIN'!E21)","v":"T / 13"},{"$f":"CONCATENATE(B14,\"/\",B16)","v":"T1/T13"},"(19)",{"$f":"IF('SCORE 24 PRINC'!K26='SCORE 24 PRINC'!M26,\"\",CONCATENATE('SCORE 24 PRINC'!K26,\" / \",'SCORE 24 PRINC'!M26,\"   (\",'SCORE 24 PRINC'!N26,\" : \",'SCORE 24 PRINC'!O26,\")\",\" (\",'SCORE 24 PRINC'!P26,\" : \",'SCORE 24 PRINC'!Q26,\")\",\" (\",'SCORE 24 PRINC'!R26,\" : \",'SCORE 24 PRINC'!S26,\")\"))","v":""},4,{"$f":"IF('SCORE 24 PRINC'!AJ11=\"\",\"\",'SCORE 24 PRINC'!AJ11)","v":""},null,null,{"$f":"IF('SCORE 24 PRINC'!J44=\"\",\"\",'SCORE 24 PRINC'!J44)","v":""}]
[null,"T24",{"$f":"CONCATENATE('EMARG M Tableau PRIN'!C32,\" / \",'EMARG M Tableau PRIN'!E32)","v":"T / 24"},{"$f":"CONCATENATE(B16,\"/\",B17)","v":"T13/T24"},"(25)",{"$f":"IF('SCORE 24 PRINC'!K32='SCORE 24 PRINC'!M32,\"\",CONCATENATE('SCORE 24 PRINC'!K32,\" / \",'SCORE 24 PRINC'!M32,\"   (\",'SCORE 24 PRINC'!N32,\" : \",'SCORE 24 PRINC'!O32,\")\",\" (\",'SCORE 24 PRINC'!P32,\" : \",'SCORE 24 PRINC'!Q32,\")\",\" (\",'SCORE 24 PRINC'!R32,\" : \",'SCORE 24 PRINC'!S32,\")\"))","v":""}]
[null,null,null,{"$f":"CONCATENATE(B14,\"/\",B15)","v":"T1/T12"},"(31)",{"$f":"IF('SCORE 24 PRINC'!K38='SCORE 24 PRINC'!M38,\"\",CONCATENATE('SCORE 24 PRINC'!K38,\" / \",'SCORE 24 PRINC'!M38,\"   (\",'SCORE 24 PRINC'!N38,\" : \",'SCORE 24 PRINC'!O38,\")\",\" (\",'SCORE 24 PRINC'!P38,\" : \",'SCORE 24 PRINC'!Q38,\")\",\" (\",'SCORE 24 PRINC'!R38,\" : \",'SCORE 24 PRINC'!S38,\")\"))","v":""},null,null,null,null,null,null,"(45)",null,{"$f":"'SCORE 24 PRINC'!T52","v":""}]
[null,null,null,null,null,null,null,null,null,null,null,null,null,null,{"$f":"IF('SCORE 24 PRINC'!K52='SCORE 24 PRINC'!M52,\"\",CONCATENATE('SCORE 24 PRINC'!K52,\" / \",'SCORE 24 PRINC'!M52,\"   (\",'SCORE 24 PRINC'!N52,\" : \",'SCORE 24 PRINC'!O52,\")\",\" (\",'SCORE 24 PRINC'!P52,\" : \",'SCORE 24 PRINC'!Q52,\")\",\" (\",'SCORE 24 PRINC'!R52,\" : \",'SCORE 24 PRINC'!S52,\")\"))","v":""}]
[null,null,null,{"$f":"CONCATENATE(B21,\"/\",B24)","v":"T2/T23"},"(2)",{"$f":"IF('SCORE 24 PRINC'!K9='SCORE 24 PRINC'!M9,\"\",CONCATENATE('SCORE 24 PRINC'!K9,\" / \",'SCORE 24 PRINC'!M9,\"   (\",'SCORE 24 PRINC'!N9,\" : \",'SCORE 24 PRINC'!O9,\")\",\" (\",'SCORE 24 PRINC'!P9,\" : \",'SCORE 24 PRINC'!Q9,\")\",\" (\",'SCORE 24 PRINC'!R9,\" : \",'SCORE 24 PRINC'!S9,\")\"))","v":""},1,{"$f":"IF('SCORE 24 PRINC'!AJ13=\"\",\"\",'SCORE 24 PRINC'!AJ13)","v":""}]
[null,"T2",{"$f":"CONCATENATE('EMARG M Tableau PRIN'!C10,\" / \",'EMARG M Tableau PRIN'!E10)","v":"T / 2"},{"$f":"CONCATENATE(B22,\"/\",B23)","v":"T11/T14"},"(8)",{"$f":"IF('SCORE 24 PRINC'!K15='SCORE 24 PRINC'!M15,\"\",CONCATENATE('SCORE 24 PRINC'!K15,\" / \",'SCORE 24 PRINC'!M15,\"   (\",'SCORE 24 PRINC'!N15,\" : \",'SCORE 24 PRINC'!O15,\")\",\" (\",'SCORE 24 PRINC'!P15,\" : \",'SCORE 24 PRINC'!Q15,\")\",\" (\",'SCORE 24 PRINC'!R15,\" : \",'SCORE 24 PRINC'!S15,\")\"))","v":""},2,{"$f":"IF('SCORE 24 PRINC'!AJ14=\"\",\"\",'SCORE 24 PRINC'!AJ14)","v":""},null,null,{"$f":"H21","v":""}]
["B","T11",{"$f":"CONCATENATE('EMARG M Tableau PRIN'!C19,\" / \",'EMARG M Tableau PRIN'!E19)","v":"T / 11"},{"$f":"CONCATENATE(B22,\"/\",B24)","v":"T11/T23"},"(14)",{"$f":"IF('SCORE 24 PRINC'!K21='SCORE 24 PRINC'!M21,\"\",CONCATENATE('SCORE 24 PRINC'!K21,\" / \",'SCORE 24 PRINC'!M21,\"   (\",'SCORE 24 PRINC'!N21,\" : \",'SCORE 24 PRINC'!O21,\")\",\" (\",'SCORE 24 PRINC'!P21,\" : \",'SCORE 24 PRINC'!Q21,\")\",\" (\",'SCORE 24 PRINC'!R21,\" : \",'SCORE 24 PRINC'!S21,\")\"))","v":""},3,{"$f":"IF('SCORE 24 PRINC'!AJ15=\"\",\"\",'SCORE 24 PRINC'!AJ15)","v":""},null,null,"2B"]
[null,"T14",{"$f":"CONCATENATE('EMARG M Tableau PRIN'!C22,\" / \",'EMARG M Tableau PRIN'!E22)","v":"T / 14"},{"$f":"CONCATENATE(B21,\"/\",B23)","v":"T2/T14"},"(20)",{"$f":"IF('SCORE 24 PRINC'!K27='SCORE 24 PRINC'!M27,\"\",CONCATENATE('SCORE 24 PRINC'!K27,\" / \",'SCORE 24 PRINC'!M27,\"   (\",'SCORE 24 PRINC'!N27,\" : \",'SCORE 24 PRINC'!O27,\")\",\" (\",'SCORE 24 PRINC'!P27,\" : \",'SCORE 24 PRINC'!Q27,\")\",\" (\",'SCORE 24 PRINC'!R27,\" : \",'SCORE 24 PRINC'!S27,\")\"))","v":""},4,{"$f":"IF('SCORE 24 PRINC'!AJ16=\"\",\"\",'SCORE 24 PRINC'!AJ16)","v":""},null,null,"2F                             (38)",null,{"$f":"'SCORE 24 PRINC'!T45","v":""}]
[null,"T23",{"$f":"CONCATENATE('EMARG M Tableau PRIN'!C31,\" / \",'EMARG M Tableau PRIN'!E31)","v":"T / 23"},{"$f":"CONCATENATE(B23,\"/\",B24)","v":"T14/T23"},"(26)",{"$f":"IF('SCORE 24 PRINC'!K33='SCORE 24 PRINC'!M33,\"\",CONCATENATE('SCORE 24 PRINC'!K33,\" / \",'SCORE 24 PRINC'!M33,\"   (\",'SCORE 24 PRINC'!N33,\" : \",'SCORE 24 PRINC'!O33,\")\",\" (\",'SCORE 24 PRINC'!P33,\" : \",'SCORE 24 PRINC'!Q33,\")\",\" (\",'SCORE 24 PRINC'!R33,\" : \",'SCORE 24 PRINC'!S33,\")\"))","v":""},null,null,null,null,{"$f":"H49","v":""},null,{"$f":"IF('SCORE 24 PRINC'!K45='SCORE 24 PRINC'!M45,\"\",CONCATENATE('SCORE 24 PRINC'!K45,\" / \",'SCORE 24 PRINC'!M45,\"   (\",'SCORE 24 PRINC'!N45,\" : \",'SCORE 24 PRINC'!O45,\")\",\" (\",'SCORE 24 PRINC'!P45,\" : \",'SCORE 24 PRINC'!Q45,\")\",\" (\",'SCORE 24 PRINC'!R45,\" : \",'SCORE 24 PRINC'!S45,\")\"))","v":""},null,"(49)",null,{"$f":"'SCORE 24 PRINC'!T56","v":""}]
[null,null,null,{"$f":"CONCATENATE(B21,\"/\",B22)","v":"T2/T11"},"(32)",{"$f":"IF('SCORE 24 PRINC'!K39='SCORE 24 PRINC'!M39,\"\",CONCATENATE('SCORE 24 PRINC'!K39,\" / \",'SCORE 24 PRINC'!M39,\"   (\",'SCORE 24 PRINC'!N39,\" : \",'SCORE 24 PRINC'!O39,\")\",\" (\",'SCORE 24 PRINC'!P39,\" : \",'SCORE 24 PRINC'!Q39,\")\",\" (\",'SCORE 24 PRINC'!R39,\" : \",'SCORE 24 PRINC'!S39,\")\"))","v":""},null,null,null,null,null,null,null,null,null,null,{"$f":"IF('SCORE 24 PRINC'!K56='SCORE 24 PRINC'!M56,\"\",CONCATENATE('SCORE 24 PRINC'!K56,\" / \",'SCORE 24 PRINC'!M56,\"   (\",'SCORE 24 PRINC'!N56,\" : \",'SCORE 24 PRINC'!O56,\")\",\" (\",'SCORE 24 PRINC'!P56,\" : \",'SCORE 24 PRINC'!Q56,\")\",\" (\",'SCORE 24 PRINC'!R56,\" : \",'SCORE 24 PRINC'!S56,\")\"))","v":""}]
[null,null,null,null,null,null,null,null,null,null,{"$f":"H28","v":""}]
[null,null,null,{"$f":"CONCATENATE(B28,\"/\",B31)","v":"T3/T22"},"(3)",{"$f":"IF('SCORE 24 PRINC'!K10='SCORE 24 PRINC'!M10,\"\",CONCATENATE('SCORE 24 PRINC'!K10,\" / \",'SCORE 24 PRINC'!M10,\"   (\",'SCORE 24 PRINC'!N10,\" : \",'SCORE 24 PRINC'!O10,\")\",\" (\",'SCORE 24 PRINC'!P10,\" : \",'SCORE 24 PRINC'!Q10,\")\",\" (\",'SCORE 24 PRINC'!R10,\" : \",'SCORE 24 PRINC'!S10,\")\"))","v":""},1,{"$f":"IF('SCORE 24 PRINC'!AJ18=\"\",\"\",'SCORE 24 PRINC'!AJ18)","v":""},null,null,"2C",null,{"$f":"'SCORE 24 PRINC'!T46","v":""}]
[null,"T3",{"$f":"CONCATENATE('EMARG M Tableau PRIN'!C11,\" / \",'EMARG M Tableau PRIN'!E11)","v":"T / 3"},{"$f":"CONCATENATE(B29,\"/\",B30)","v":"T10/T15"},"(9)",{"$f":"IF('SCORE 24 PRINC'!K16='SCORE 24 PRINC'!M16,\"\",CONCATENATE('SCORE 24 PRINC'!K16,\" / \",'SCORE 24 PRINC'!M16,\"   (\",'SCORE 24 PRINC'!N16,\" : \",'SCORE 24 PRINC'!O16,\")\",\" (\",'SCORE 24 PRINC'!P16,\" : \",'SCORE 24 PRINC'!Q16,\")\",\" (\",'SCORE 24 PRINC'!R16,\" : \",'SCORE 24 PRINC'!S16,\")\"))","v":""},2,{"$f":"IF('SCORE 24 PRINC'!AJ19=\"\",\"\",'SCORE 24 PRINC'!AJ19)","v":""},null,null,"1E                                 (39)",null,{"$f":"IF('SCORE 24 PRINC'!K46='SCORE 24 PRINC'!M46,\"\",CONCATENATE('SCORE 24 PRINC'!K46,\" / \",'SCORE 24 PRINC'!M46,\"   (\",'SCORE 24 PRINC'!N46,\" : \",'SCORE 24 PRINC'!O46,\")\",\" (\",'SCORE 24 PRINC'!P46,\" : \",'SCORE 24 PRINC'!Q46,\")\",\" (\",'SCORE 24 PRINC'!R46,\" : \",'SCORE 24 PRINC'!S46,\")\"))","v":""}]
["C","T10",{"$f":"CONCATENATE('EMARG M Tableau PRIN'!C18,\" / \",'EMARG M Tableau PRIN'!E18)","v":"T / 10"},{"$f":"CONCATENATE(B29,\"/\",B31)","v":"T10/T22"},"(15)",{"$f":"IF('SCORE 24 PRINC'!K22='SCORE 24 PRINC'!M22,\"\",CONCATENATE('SCORE 24 PRINC'!K22,\" / \",'SCORE 24 PRINC'!M22,\"   (\",'SCORE 24 PRINC'!N22,\" : \",'SCORE 24 PRINC'!O22,\")\",\" (\",'SCORE 24 PRINC'!P22,\" : \",'SCORE 24 PRINC'!Q22,\")\",\" (\",'SCORE 24 PRINC'!R22,\" : \",'SCORE 24 PRINC'!S22,\")\"))","v":""},3,{"$f":"IF('SCORE 24 PRINC'!AJ20=\"\",\"\",'SCORE 24 PRINC'!AJ20)","v":""},null,null,{"$f":"H41","v":""}]
[null,"T15",{"$f":"CONCATENATE('EMARG M Tableau PRIN'!C23,\" / \",'EMARG M Tableau PRIN'!E23)","v":"T / 15"},{"$f":"CONCATENATE(B28,\"/\",B30)","v":"T3/T15"},"(21)",{"$f":"IF('SCORE 24 PRINC'!K28='SCORE 24 PRINC'!M28,\"\",CONCATENATE('SCORE 24 PRINC'!K28,\" / \",'SCORE 24 PRINC'!M28,\"   (\",'SCORE 24 PRINC'!N28,\" : \",'SCORE 24 PRINC'!O28,\")\",\" (\",'SCORE 24 PRINC'!P28,\" : \",'SCORE 24 PRINC'!Q28,\")\",\" (\",'SCORE 24 PRINC'!R28,\" : \",'SCORE 24 PRINC'!S28,\")\"))","v":""},4,{"$f":"IF('SCORE 24 PRINC'!AJ21=\"\",\"\",'SCORE 24 PRINC'!AJ21)","v":""},null,null,null,null,"(46)"]
[null,"T22",{"$f":"CONCATENATE('EMARG M Tableau PRIN'!C30,\" / \",'EMARG M Tableau PRIN'!E30)","v":"T / 22"},{"$f":"CONCATENATE(B30,\"/\",B31)","v":"T15/T22"},"(27)",{"$f":"IF('SCORE 24 PRINC'!K34='SCORE 24 PRINC'!M34,\"\",CONCATENATE('SCORE 24 PRINC'!K34,\" / \",'SCORE 24 PRINC'!M34,\"   (\",'SCORE 24 PRINC'!N34,\" : \",'SCORE 24 PRINC'!O34,\")\",\" (\",'SCORE 24 PRINC'!P34,\" : \",'SCORE 24 PRINC'!Q34,\")\",\" (\",'SCORE 24 PRINC'!R34,\" : \",'SCORE 24 PRINC'!S34,\")\"))","v":""}]
[null,null,null,{"$f":"CONCATENATE(B28,\"/\",B29)","v":"T3/T10"},"(33)",{"$f":"IF('SCORE 24 PRINC'!K40='SCORE 24 PRINC'!M40,\"\",CONCATENATE('SCORE 24 PRINC'!K40,\" / \",'SCORE 24 PRINC'!M40,\"   (\",'SCORE 24 PRINC'!N40,\" : \",'SCORE 24 PRINC'!O40,\")\",\" (\",'SCORE 24 PRINC'!P40,\" : \",'SCORE 24 PRINC'!Q40,\")\",\" (\",'SCORE 24 PRINC'!R40,\" : \",'SCORE 24 PRINC'!S40,\")\"))","v":""},null,null,null,null,null,null,null,null,{"$f":"'SCORE 24 PRINC'!T53","v":""}]
[null,null,null,null,null,null,null,null,null,null,null,null,null,null,{"$f":"IF('SCORE 24 PRINC'!K53='SCORE 24 PRINC'!M53,\"\",CONCATENATE('SCORE 24 PRINC'!K53,\" / \",'SCORE 24 PRINC'!M53,\"   (\",'SCORE 24 PRINC'!N53,\" : \",'SCORE 24 PRINC'!O53,\")\",\" (\",'SCORE 24 PRINC'!P53,\" : \",'SCORE 24 PRINC'!Q53,\")\",\" (\",'SCORE 24 PRINC'!R53,\" : \",'SCORE 24 PRINC'!S53,\")\"))","v":""}]
[null,null,null,{"$f":"CONCATENATE(B35,\"/\",B38)","v":"T4/T21"},"(4)",{"$f":"IF('SCORE 24 PRINC'!K11='SCORE 24 PRINC'!M11,\"\",CONCATENATE('SCORE 24 PRINC'!K11,\" / \",'SCORE 24 PRINC'!M11,\"   (\",'SCORE 24 PRINC'!N11,\" : \",'SCORE 24 PRINC'!O11,\")\",\" (\",'SCORE 24 PRINC'!P11,\" : \",'SCORE 24 PRINC'!Q11,\")\",\" (\",'SCORE 24 PRINC'!R11,\" : \",'SCORE 24 PRINC'!S11,\")\"))","v":""},1,{"$f":"IF('SCORE 24 PRINC'!AJ23=\"\",\"\",'SCORE 24 PRINC'!AJ23)","v":""},null,null,{"$f":"IF('SCORE 24 PRINC'!J47=\"\",\"\",'SCORE 24 PRINC'!J47)","v":""}]
[null,"T4",{"$f":"CONCATENATE('EMARG M Tableau PRIN'!C12,\" / \",'EMARG M Tableau PRIN'!E12)","v":"T / 4"},{"$f":"CONCATENATE(B36,\"/\",B37)","v":"T9/T16"},"(10)",{"$f":"IF('SCORE 24 PRINC'!K17='SCORE 24 PRINC'!M17,\"\",CONCATENATE('SCORE 24 PRINC'!K17,\" / \",'SCORE 24 PRINC'!M17,\"   (\",'SCORE 24 PRINC'!N17,\" : \",'SCORE 24 PRINC'!O17,\")\",\" (\",'SCORE 24 PRINC'!P17,\" : \",'SCORE 24 PRINC'!Q17,\")\",\" (\",'SCORE 24 PRINC'!R17,\" : \",'SCORE 24 PRINC'!S17,\")\"))","v":""},2,{"$f":"IF('SCORE 24 PRINC'!AJ24=\"\",\"\",'SCORE 24 PRINC'!AJ24)","v":""},null,null,"3(A,B,C,E,F)"]
["D","T9",{"$f":"CONCATENATE('EMARG M Tableau PRIN'!C17,\" / \",'EMARG M Tableau PRIN'!E17)","v":"T / 9"},{"$f":"CONCATENATE(B36,\"/\",B38)","v":"T9/T21"},"(16)",{"$f":"IF('SCORE 24 PRINC'!K23='SCORE 24 PRINC'!M23,\"\",CONCATENATE('SCORE 24 PRINC'!K23,\" / \",'SCORE 24 PRINC'!M23,\"   (\",'SCORE 24 PRINC'!N23,\" : \",'SCORE 24 PRINC'!O23,\")\",\" (\",'SCORE 24 PRINC'!P23,\" : \",'SCORE 24 PRINC'!Q23,\")\",\" (\",'SCORE 24 PRINC'!R23,\" : \",'SCORE 24 PRINC'!S23,\")\"))","v":""},3,{"$f":"IF('SCORE 24 PRINC'!AJ25=\"\",\"\",'SCORE 24 PRINC'!AJ25)","v":""},null,null,"1D                           (40)",null,{"$f":"'SCORE 24 PRINC'!T41","v":""}]
[null,"T16",{"$f":"CONCATENATE('EMARG M Tableau PRIN'!C24,\" / \",'EMARG M Tableau PRIN'!E24)","v":"T / 16"},{"$f":"CONCATENATE(B35,\"/\",B37)","v":"T4/T16"},"(22)",{"$f":"IF('SCORE 24 PRINC'!K29='SCORE 24 PRINC'!M29,\"\",CONCATENATE('SCORE 24 PRINC'!K29,\" / \",'SCORE 24 PRINC'!M29,\"   (\",'SCORE 24 PRINC'!N29,\" : \",'SCORE 24 PRINC'!O29,\")\",\" (\",'SCORE 24 PRINC'!P29,\" : \",'SCORE 24 PRINC'!Q29,\")\",\" (\",'SCORE 24 PRINC'!R29,\" : \",'SCORE 24 PRINC'!S29,\")\"))","v":""},4,{"$f":"IF('SCORE 24 PRINC'!AJ26=\"\",\"\",'SCORE 24 PRINC'!AJ26)","v":""},null,null,{"$f":"H34","v":""},null,{"$f":"IF('SCORE 24 PRINC'!K47='SCORE 24 PRINC'!M47,\"\",CONCATENATE('SCORE 24 PRINC'!K47,\" / \",'SCORE 24 PRINC'!M47,\"   (\",'SCORE 24 PRINC'!N47,\" : \",'SCORE 24 PRINC'!O47,\")\",\" (\",'SCORE 24 PRINC'!P47,\" : \",'SCORE 24 PRINC'!Q47,\")\",\" (\",'SCORE 24 PRINC'!R47,\" : \",'SCORE 24 PRINC'!S47,\")\"))","v":""},null,null,null,"(52)",{"$f":"'SCORE 24 PRINC'!T59","v":""}]
[null,"T21",{"$f":"CONCATENATE('EMARG M Tableau PRIN'!C29,\" / \",'EMARG M Tableau PRIN'!E29)","v":"T / 21"},{"$f":"CONCATENATE(B37,\"/\",B38)","v":"T16/T21"},"(28)",{"$f":"IF('SCORE 24 PRINC'!K35='SCORE 24 PRINC'!M35,\"\",CONCATENATE('SCORE 24 PRINC'!K35,\" / \",'SCORE 24 PRINC'!M35,\"   (\",'SCORE 24 PRINC'!N35,\" : \",'SCORE 24 PRINC'!O35,\")\",\" (\",'SCORE 24 PRINC'!P35,\" : \",'SCORE 24 PRINC'!Q35,\")\",\" (\",'SCORE 24 PRINC'!R35,\" : \",'SCORE 24 PRINC'!S35,\")\"))","v":""},null,null,null,null,null,null,null,null,null,null,null,{"$f":"IF('SCORE 24 PRINC'!K59='SCORE 24 PRINC'!M59,\"\",CONCATENATE('SCORE 24 PRINC'!K59,\" / \",'SCORE 24 PRINC'!M59,\"   (\",'SCORE 24 PRINC'!N59,\" : \",'SCORE 24 PRINC'!O59,\")\",\" (\",'SCORE 24 PRINC'!P59,\" : \",'SCORE 24 PRINC'!Q59,\")\",\" (\",'SCORE 24 PRINC'!R59,\" : \",'SCORE 24 PRINC'!S59,\")\"))","v":""}]
[null,null,null,{"$f":"CONCATENATE(B35,\"/\",B36)","v":"T4/T9"},"(34)",{"$f":"IF('SCORE 24 PRINC'!K41='SCORE 24 PRINC'!M41,\"\",CONCATENATE('SCORE 24 PRINC'!K41,\" / \",'SCORE 24 PRINC'!M41,\"   (\",'SCORE 24 PRINC'!N41,\" : \",'SCORE 24 PRINC'!O41,\")\",\" (\",'SCORE 24 PRINC'!P41,\" : \",'SCORE 24 PRINC'!Q41,\")\",\" (\",'SCORE 24 PRINC'!R41,\" : \",'SCORE 24 PRINC'!S41,\")\"))","v":""},null,null,null,null,{"$f":"H27","v":""}]
[null,null,null,null,null,null,null,null,null,null,"1C",null,{"$f":"'SCORE 24 PRINC'!T48","v":""}]
[null,null,null,{"$f":"CONCATENATE(B42,\"/\",B45)","v":"T5/T20"},"(5)",{"$f":"IF('SCORE 24 PRINC'!K12='SCORE 24 PRINC'!M12,\"\",CONCATENATE('SCORE 24 PRINC'!K12,\" / \",'SCORE 24 PRINC'!M12,\"   (\",'SCORE 24 PRINC'!N12,\" : \",'SCORE 24 PRINC'!O12,\")\",\" (\",'SCORE 24 PRINC'!P12,\" : \",'SCORE 24 PRINC'!Q12,\")\",\" (\",'SCORE 24 PRINC'!R12,\" : \",'SCORE 24 PRINC'!S12,\")\"))","v":""},1,{"$f":"IF('SCORE 24 PRINC'!AJ28=\"\",\"\",'SCORE 24 PRINC'!AJ28)","v":""},null,null,"3(A,B,D,E,F)             (41)",null,{"$f":"IF('SCORE 24 PRINC'!K48='SCORE 24 PRINC'!M48,\"\",CONCATENATE('SCORE 24 PRINC'!K48,\" / \",'SCORE 24 PRINC'!M48,\"   (\",'SCORE 24 PRINC'!N48,\" : \",'SCORE 24 PRINC'!O48,\")\",\" (\",'SCORE 24 PRINC'!P48,\" : \",'SCORE 24 PRINC'!Q48,\")\",\" (\",'SCORE 24 PRINC'!R48,\" : \",'SCORE 24 PRINC'!S48,\")\"))","v":""}]
[null,"T5",{"$f":"CONCATENATE('EMARG M Tableau PRIN'!C13,\" / \",'EMARG M Tableau PRIN'!E13)","v":"T / 5"},{"$f":"CONCATENATE(B43,\"/\",B44)","v":"T8/T17"},"(11)",{"$f":"IF('SCORE 24 PRINC'!K18='SCORE 24 PRINC'!M18,\"\",CONCATENATE('SCORE 24 PRINC'!K18,\" / \",'SCORE 24 PRINC'!M18,\"   (\",'SCORE 24 PRINC'!N18,\" : \",'SCORE 24 PRINC'!O18,\")\",\" (\",'SCORE 24 PRINC'!P18,\" : \",'SCORE 24 PRINC'!Q18,\")\",\" (\",'SCORE 24 PRINC'!R18,\" : \",'SCORE 24 PRINC'!S18,\")\"))","v":""},2,{"$f":"IF('SCORE 24 PRINC'!AJ29=\"\",\"\",'SCORE 24 PRINC'!AJ29)","v":""},null,null,{"$f":"IF('SCORE 24 PRINC'!J48=\"\",\"\",'SCORE 24 PRINC'!J48)","v":""}]
["E","T8",{"$f":"CONCATENATE('EMARG M Tableau PRIN'!C16,\" / \",'EMARG M Tableau PRIN'!E16)","v":"T / 8"},{"$f":"CONCATENATE(B43,\"/\",B45)","v":"T8/T20"},"(17)",{"$f":"IF('SCORE 24 PRINC'!K24='SCORE 24 PRINC'!M24,\"\",CONCATENATE('SCORE 24 PRINC'!K24,\" / \",'SCORE 24 PRINC'!M24,\"   (\",'SCORE 24 PRINC'!N24,\" : \",'SCORE 24 PRINC'!O24,\")\",\" (\",'SCORE 24 PRINC'!P24,\" : \",'SCORE 24 PRINC'!Q24,\")\",\" (\",'SCORE 24 PRINC'!R24,\" : \",'SCORE 24 PRINC'!S24,\")\"))","v":""},3,{"$f":"IF('SCORE 24 PRINC'!AJ30=\"\",\"\",'SCORE 24 PRINC'!AJ30)","v":""},null,null,null,null,"(47)"]
[null,"T17",{"$f":"CONCATENATE('EMARG M Tableau PRIN'!C25,\" / \",'EMARG M Tableau PRIN'!E25)","v":"T / 17"},{"$f":"CONCATENATE(B42,\"/\",B44)","v":"T5/T17"},"(23)",{"$f":"IF('SCORE 24 PRINC'!K30='SCORE 24 PRINC'!M30,\"\",CONCATENATE('SCORE 24 PRINC'!K30,\" / \",'SCORE 24 PRINC'!M30,\"   (\",'SCORE 24 PRINC'!N30,\" : \",'SCORE 24 PRINC'!O30,\")\",\" (\",'SCORE 24 PRINC'!P30,\" : \",'SCORE 24 PRINC'!Q30,\")\",\" (\",'SCORE 24 PRINC'!R30,\" : \",'SCORE 24 PRINC'!S30,\")\"))","v":""},4,{"$f":"IF('SCORE 24 PRINC'!AJ31=\"\",\"\",'SCORE 24 PRINC'!AJ31)","v":""},null,null,null,null,null,null,{"$f":"'SCORE 24 PRINC'!T54","v":""}]
[null,"T20",{"$f":"CONCATENATE('EMARG M Tableau PRIN'!C28,\" / \",'EMARG M Tableau PRIN'!E28)","v":"T / 20"},{"$f":"CONCATENATE(B44,\"/\",B45)","v":"T17/T20"},"(29)",{"$f":"IF('SCORE 24 PRINC'!K36='SCORE 24 PRINC'!M36,\"\",CONCATENATE('SCORE 24 PRINC'!K36,\" / \",'SCORE 24 PRINC'!M36,\"   (\",'SCORE 24 PRINC'!N36,\" : \",'SCORE 24 PRINC'!O36,\")\",\" (\",'SCORE 24 PRINC'!P36,\" : \",'SCORE 24 PRINC'!Q36,\")\",\" (\",'SCORE 24 PRINC'!R36,\" : \",'SCORE 24 PRINC'!S36,\")\"))","v":""},null,null,null,null,null,null,null,null,{"$f":"IF('SCORE 24 PRINC'!K54='SCORE 24 PRINC'!M54,\"\",CONCATENATE('SCORE 24 PRINC'!K54,\" / \",'SCORE 24 PRINC'!M54,\"   (\",'SCORE 24 PRINC'!N54,\" : \",'SCORE 24 PRINC'!O54,\")\",\" (\",'SCORE 24 PRINC'!P54,\" : \",'SCORE 24 PRINC'!Q54,\")\",\" (\",'SCORE 24 PRINC'!R54,\" : \",'SCORE 24 PRINC'!S54,\")\"))","v":""}]
[null,null,null,{"$f":"CONCATENATE(B42,\"/\",B43)","v":"T5/T8"},"(35)",{"$f":"IF('SCORE 24 PRINC'!K42='SCORE 24 PRINC'!M42,\"\",CONCATENATE('SCORE 24 PRINC'!K42,\" / \",'SCORE 24 PRINC'!M42,\"   (\",'SCORE 24 PRINC'!N42,\" : \",'SCORE 24 PRINC'!O42,\")\",\" (\",'SCORE 24 PRINC'!P42,\" : \",'SCORE 24 PRINC'!Q42,\")\",\" (\",'SCORE 24 PRINC'!R42,\" : \",'SCORE 24 PRINC'!S42,\")\"))","v":""}]
[null,null,null,null,null,null,null,null,null,null,{"$f":"H42","v":""}]
[null,null,null,{"$f":"CONCATENATE(B49,\"/\",B52)","v":"T6/T19"},"(6)",{"$f":"IF('SCORE 24 PRINC'!K13='SCORE 24 PRINC'!M13,\"\",CONCATENATE('SCORE 24 PRINC'!K13,\" / \",'SCORE 24 PRINC'!M13,\"   (\",'SCORE 24 PRINC'!N13,\" : \",'SCORE 24 PRINC'!O13,\")\",\" (\",'SCORE 24 PRINC'!P13,\" : \",'SCORE 24 PRINC'!Q13,\")\",\" (\",'SCORE 24 PRINC'!R13,\" : \",'SCORE 24 PRINC'!S13,\")\"))","v":""},1,{"$f":"IF('SCORE 24 PRINC'!AJ33=\"\",\"\",'SCORE 24 PRINC'!AJ33)","v":""},null,null,"2E"]
[null,"T6",{"$f":"CONCATENATE('EMARG M Tableau PRIN'!C14,\" / \",'EMARG M Tableau PRIN'!E14)","v":"T / 6"},{"$f":"CONCATENATE(B50,\"/\",B51)","v":"T7/T18"},"(12)",{"$f":"IF('SCORE 24 PRINC'!K19='SCORE 24 PRINC'!M19,\"\",CONCATENATE('SCORE 24 PRINC'!K19,\" / \",'SCORE 24 PRINC'!M19,\"   (\",'SCORE 24 PRINC'!N19,\" : \",'SCORE 24 PRINC'!O19,\")\",\" (\",'SCORE 24 PRINC'!P19,\" : \",'SCORE 24 PRINC'!Q19,\")\",\" (\",'SCORE 24 PRINC'!R19,\" : \",'SCORE 24 PRINC'!S19,\")\"))","v":""},2,{"$f":"IF('SCORE 24 PRINC'!AJ34=\"\",\"\",'SCORE 24 PRINC'!AJ34)","v":""},null,null,"1F                             (42)",null,{"$f":"'SCORE 24 PRINC'!T49","v":""}]
["F","T7",{"$f":"CONCATENATE('EMARG M Tableau PRIN'!C15,\" / \",'EMARG M Tableau PRIN'!E15)","v":"T / 7"},{"$f":"CONCATENATE(B50,\"/\",B52)","v":"T7/T19"},"(18)",{"$f":"IF('SCORE 24 PRINC'!K25='SCORE 24 PRINC'!M25,\"\",CONCATENATE('SCORE 24 PRINC'!K25,\" / \",'SCORE 24 PRINC'!M25,\"   (\",'SCORE 24 PRINC'!N25,\" : \",'SCORE 24 PRINC'!O25,\")\",\" (\",'SCORE 24 PRINC'!P25,\" : \",'SCORE 24 PRINC'!Q25,\")\",\" (\",'SCORE 24 PRINC'!R25,\" : \",'SCORE 24 PRINC'!S25,\")\"))","v":""},3,{"$f":"IF('SCORE 24 PRINC'!AJ35=\"\",\"\",'SCORE 24 PRINC'!AJ35)","v":""},null,null,{"$f":"H48","v":""},null,{"$f":"IF('SCORE 24 PRINC'!K49='SCORE 24 PRINC'!M49,\"\",CONCATENATE('SCORE 24 PRINC'!K49,\" / \",'SCORE 24 PRINC'!M49,\"   (\",'SCORE 24 PRINC'!N49,\" : \",'SCORE 24 PRINC'!O49,\")\",\" (\",'SCORE 24 PRINC'!P49,\" : \",'SCORE 24 PRINC'!Q49,\")\",\" (\",'SCORE 24 PRINC'!R49,\" : \",'SCORE 24 PRINC'!S49,\")\"))","v":""}]
[null,"T18",{"$f":"CONCATENATE('EMARG M Tableau PRIN'!C26,\" / \",'EMARG M Tableau PRIN'!E26)","v":"T / 18"},{"$f":"CONCATENATE(B49,\"/\",B51)","v":"T6/T18"},"(24)",{"$f":"IF('SCORE 24 PRINC'!K31='SCORE 24 PRINC'!M31,\"\",CONCATENATE('SCORE 24 PRINC'!K31,\" / \",'SCORE 24 PRINC'!M31,\"   (\",'SCORE 24 PRINC'!N31,\" : \",'SCORE 24 PRINC'!O31,\")\",\" (\",'SCORE 24 PRINC'!P31,\" : \",'SCORE 24 PRINC'!Q31,\")\",\" (\",'SCORE 24 PRINC'!R31,\" : \",'SCORE 24 PRINC'!S31,\")\"))","v":""},4,{"$f":"IF('SCORE 24 PRINC'!AJ36=\"\",\"\",'SCORE 24 PRINC'!AJ36)","v":""},null,null,null,null,null,null,"(50)"]
[null,"T19",{"$f":"CONCATENATE('EMARG M Tableau PRIN'!C27,\" / \",'EMARG M Tableau PRIN'!E27)","v":"T / 19"},{"$f":"CONCATENATE(B51,\"/\",B52)","v":"T18/T19"},"(30)",{"$f":"IF('SCORE 24 PRINC'!K37='SCORE 24 PRINC'!M37,\"\",CONCATENATE('SCORE 24 PRINC'!K37,\" / \",'SCORE 24 PRINC'!M37,\"   (\",'SCORE 24 PRINC'!N37,\" : \",'SCORE 24 PRINC'!O37,\")\",\" (\",'SCORE 24 PRINC'!P37,\" : \",'SCORE 24 PRINC'!Q37,\")\",\" (\",'SCORE 24 PRINC'!R37,\" : \",'SCORE 24 PRINC'!S37,\")\"))","v":""},null,null,null,null,{"$f":"H14","v":""},null,null,null,null,null,{"$f":"'SCORE 24 PRINC'!T57","v":""}]
[null,null,null,{"$f":"CONCATENATE(B49,\"/\",B50)","v":"T6/T7"},"(36)",{"$f":"IF('SCORE 24 PRINC'!K43='SCORE 24 PRINC'!M43,\"\",CONCATENATE('SCORE 24 PRINC'!K43,\" / \",'SCORE 24 PRINC'!M43,\"   (\",'SCORE 24 PRINC'!N43,\" : \",'SCORE 24 PRINC'!O43,\")\",\" (\",'SCORE 24 PRINC'!P43,\" : \",'SCORE 24 PRINC'!Q43,\")\",\" (\",'SCORE 24 PRINC'!R43,\" : \",'SCORE 24 PRINC'!S43,\")\"))","v":""},null,null,null,null,"2A",null,{"$f":"'SCORE 24 PRINC'!T50","v":""},null,null,null,{"$f":"IF('SCORE 24 PRINC'!K57='SCORE 24 PRINC'!M57,\"\",CONCATENATE('SCORE 24 PRINC'!K57,\" / \",'SCORE 24 PRINC'!M57,\"   (\",'SCORE 24 PRINC'!N57,\" : \",'SCORE 24 PRINC'!O57,\")\",\" (\",'SCORE 24 PRINC'!P57,\" : \",'SCORE 24 PRINC'!Q57,\")\",\" (\",'SCORE 24 PRINC'!R57,\" : \",'SCORE 24 PRINC'!S57,\")\"))","v":""}]
[null,null,null,null,null,null,null,null,null,null,"2D                         (43)",null,{"$f":"IF('SCORE 24 PRINC'!K50='SCORE 24 PRINC'!M50,\"\",CONCATENATE('SCORE 24 PRINC'!K50,\" / \",'SCORE 24 PRINC'!M50,\"   (\",'SCORE 24 PRINC'!N50,\" : \",'SCORE 24 PRINC'!O50,\")\",\" (\",'SCORE 24 PRINC'!P50,\" : \",'SCORE 24 PRINC'!Q50,\")\",\" (\",'SCORE 24 PRINC'!R50,\" : \",'SCORE 24 PRINC'!S50,\")\"))","v":""}]
[null,null,null,null,null,null,null,null,null,null,{"$f":"H35","v":""}]
[null,null,null,null,null,null,null,null,null,null,null,null,"(48)"]
[]
[null,null,null,null,null,null,null,null,null,null,null,null,null,null,{"$f":"'SCORE 24 PRINC'!T55","v":""}]
[null,null,null,null,null,null,null,null,null,null,null,null,null,null,{"$f":"IF('SCORE 24 PRINC'!K55='SCORE 24 PRINC'!M55,\"\",CONCATENATE('SCORE 24 PRINC'!K55,\" / \",'SCORE 24 PRINC'!M55,\"   (\",'SCORE 24 PRINC'!N55,\" : \",'SCORE 24 PRINC'!O55,\")\",\" (\",'SCORE 24 PRINC'!P55,\" : \",'SCORE 24 PRINC'!Q55,\")\",\" (\",'SCORE 24 PRINC'!R55,\" : \",'SCORE 24 PRINC'!S55,\")\"))","v":""}]
[null,null,null,null,null,null,null,null,null,null,{"$f":"IF('SCORE 24 PRINC'!J51=\"\",\"\",'SCORE 24 PRINC'!J51)","v":""}]
[null,null,null,null,null,null,null,null,null,null,"3(A,C,D,E,F)"]
[null,null,null,null,null,null,null,null,null,null,"1B                               (44)",null,{"$f":"'SCORE 24 PRINC'!T51","v":""}]
[null,null,null,null,null,null,null,null,null,null,{"$f":"H20","v":""},null,{"$f":"IF('SCORE 24 PRINC'!K51='SCORE 24 PRINC'!M51,\"\",CONCATENATE('SCORE 24 PRINC'!K51,\" / \",'SCORE 24 PRINC'!M51,\"   (\",'SCORE 24 PRINC'!N51,\" : \",'SCORE 24 PRINC'!O51,\")\",\" (\",'SCORE 24 PRINC'!P51,\" : \",'SCORE 24 PRINC'!Q51,\")\",\" (\",'SCORE 24 PRINC'!R51,\" : \",'SCORE 24 PRINC'!S51,\")\"))","v":""}]
[null,null,null,null,null,null,null,null,null,null,null,null,null,null,null,null,{"$f":"'SCORE 24 PRINC'!U56","v":""}]
[]
[null,null,null,null,null,null,null,null,null,null,null,null,null,null,null,null,"(51)",{"$f":"'SCORE 24 PRINC'!T58","v":""}]
[null,null,null,null,null,null,null,null,null,null,null,null,null,null,null,null,null,{"$f":"IF('SCORE 24 PRINC'!K58='SCORE 24 PRINC'!M58,\"\",CONCATENATE('SCORE 24 PRINC'!K58,\" / \",'SCORE 24 PRINC'!M58,\"   (\",'SCORE 24 PRINC'!N58,\" : \",'SCORE 24 PRINC'!O58,\")\",\" (\",'SCORE 24 PRINC'!P58,\" : \",'SCORE 24 PRINC'!Q58,\")\",\" (\",'SCORE 24 PRINC'!R58,\" : \",'SCORE 24 PRINC'!S58,\")\"))","v":""}]
[]
[null,null,null,null,null,null,null,null,null,null,null,null,null,null,null,null,{"$f":"'SCORE 24 PRINC'!U57","v":""}]

{"sheet":"RELEVE","index":10,"n_rows":118,"n_cols":14,"rows_kept":118,"cut":false,"hidden":false,"merged":[[9,8,9,9],[2,2,2,3],[2,4,2,10],[3,2,3,3],[3,4,3,5],[4,2,4,3],[4,4,4,5],[5,2,5,3],[5,4,5,5],[6,2,6,3],[6,4,6,5],[8,8,8,9],[117,2,123,10],[14,4,14,6],[15,2,15,3],[15,4,15,6],[16,2,16,3],[16,4,16,6],[17,2,17,3],[17,4,17,6],[18,2,18,3],[18,4,18,6],[19,2,19,3],[19,4,19,6],[108,2,114,10]]}
[null,null,"RELEVE DES RESULTATS ET SANCTIONS - TOURNOI DE BEACH VOLLEY"]
[]
[null,null,"APPELATION DU TOURNOI",null,{"$f":"IF('LISTE ENGAGES'!R3=\"\",\"\",'LISTE ENGAGES'!R3)","v":""}]
[null,null,"TYPE",null,{"$f":"IF('LISTE ENGAGES'!R5=\"\",\"\",'LISTE ENGAGES'!R5)","v":""}]
[null,null,"GENRE",null,{"$f":"IF('LISTE ENGAGES'!R9=\"\",\"\",'LISTE ENGAGES'!R9)","v":""}]
[null,null,"DATE",null,{"$f":"IF('LISTE ENGAGES'!R6=\"\",\"\",CONCATENATE('LISTE ENGAGES'!R7,\"-\",'LISTE ENGAGES'!R8,\"/\",'LISTE ENGAGES'!R6))","v":""}]
[null,null,"ORGANISATEUR",null,{"$f":"IF('LISTE ENGAGES'!R10=\"\",\"\",'LISTE ENGAGES'!R10)","v":""}]
[]
[null,null,"NOMBRE EQUIPE TABLEAU :",null,null,"PRINCIPAL",null,null,"QUALIFICATION"]
[null,null,"NOMBRE EQUIPE PRESENTES PAR TABLEAU",null,null,"PRINCIPAL",null,null,"QUALIFICATION"]
[]
[]
[null,null,"COMPOSITION DE LA COMMISSION DE DIRECTION"]
[]
[null,null,"DELEGUE INSTANCE FEDERAL"]
[null,null,"SUPERVISEUR"]
[null,null,"JUGE ARBITRE"]
[null,null,"ORGANISATEUR"]
[null,null,"REPRESENTANT JOUEURS"]
[null,null,"RAPPORTEUR*"]
[]
[]
[]
[]
[]
[null,null,"EQUIPES ABSENTES"]
[null,null,"NOM","PRENOM","LIC J1","club J1","NOM2","PRENOM3","LIC J2","club J2"]
[]
[]
[]
[]
[]
[]
[null,null,"RECLAMATIONS"]
[null,null,"NOM","PRENOM","LIC J1","club J1","NOM2","PRENOM3","LIC J2","club J2","RANG","NIVEAU","MOTIF ","AVIS COMMISSION"]
[null,1]
[null,2]
[null,3]
[null,4]
[null,5]
[null,6]
[]
[null,null,"EQUIPES/JOUEURS SANCTIONNES"]
[null,null,"NOM","PRENOM","LIC J1","club J1","NOM2","PRENOM3","LIC J2","club J2","RANG","SANCTION","MOTIF ","AVIS COMMISSION"]
[null,1]
[null,2]
[null,3]
[null,4]
[null,5]
[null,6]
[]
[null,null,"CLASSEMENT FINAL"]
[null,null,"NOM","PRENOM","LIC J1","club J1","NOM2","PRENOM3","LIC J2","club J2","RANG"]
[null,null,{"$f":"'LISTE ENGAGES'!C9","v":"T"},{"$f":"'LISTE ENGAGES'!D9","v":0},{"$f":"'LISTE ENGAGES'!E9","v":0},{"$f":"'LISTE ENGAGES'!F9","v":0},{"$f":"'LISTE ENGAGES'!G9","v":1},{"$f":"'LISTE ENGAGES'!H9","v":0},{"$f":"'LISTE ENGAGES'!I9","v":0},{"$f":"'LISTE ENGAGES'!J9","v":0}]
[null,null,{"$f":"'LISTE ENGAGES'!C10","v":"T"},{"$f":"'LISTE ENGAGES'!D10","v":0},{"$f":"'LISTE ENGAGES'!E10","v":0},{"$f":"'LISTE ENGAGES'!F10","v":0},{"$f":"'LISTE ENGAGES'!G10","v":2},{"$f":"'LISTE ENGAGES'!H10","v":0},{"$f":"'LISTE ENGAGES'!I10","v":0},{"$f":"'LISTE ENGAGES'!J10","v":0}]
[null,null,{"$f":"'LISTE ENGAGES'!C11","v":"T"},{"$f":"'LISTE ENGAGES'!D11","v":0},{"$f":"'LISTE ENGAGES'!E11","v":0},{"$f":"'LISTE ENGAGES'!F11","v":0},{"$f":"'LISTE ENGAGES'!G11","v":3},{"$f":"'LISTE ENGAGES'!H11","v":0},{"$f":"'LISTE ENGAGES'!I11","v":0},{"$f":"'LISTE ENGAGES'!J11","v":0}]
[null,null,{"$f":"'LISTE ENGAGES'!C12","v":"T"},{"$f":"'LISTE ENGAGES'!D12","v":0},{"$f":"'LISTE ENGAGES'!E12","v":0},{"$f":"'LISTE ENGAGES'!F12","v":0},{"$f":"'LISTE ENGAGES'!G12","v":4},{"$f":"'LISTE ENGAGES'!H12","v":0},{"$f":"'LISTE ENGAGES'!I12","v":0},{"$f":"'LISTE ENGAGES'!J12","v":0}]
[null,null,{"$f":"'LISTE ENGAGES'!C13","v":"T"},{"$f":"'LISTE ENGAGES'!D13","v":0},{"$f":"'LISTE ENGAGES'!E13","v":0},{"$f":"'LISTE ENGAGES'!F13","v":0},{"$f":"'LISTE ENGAGES'!G13","v":5},{"$f":"'LISTE ENGAGES'!H13","v":0},{"$f":"'LISTE ENGAGES'!I13","v":0},{"$f":"'LISTE ENGAGES'!J13","v":0}]
[null,null,{"$f":"'LISTE ENGAGES'!C14","v":"T"},{"$f":"'LISTE ENGAGES'!D14","v":0},{"$f":"'LISTE ENGAGES'!E14","v":0},{"$f":"'LISTE ENGAGES'!F14","v":0},{"$f":"'LISTE ENGAGES'!G14","v":6},{"$f":"'LISTE ENGAGES'!H14","v":0},{"$f":"'LISTE ENGAGES'!I14","v":0},{"$f":"'LISTE ENGAGES'!J14","v":0}]
[null,null,{"$f":"'LISTE ENGAGES'!C15","v":"T"},{"$f":"'LISTE ENGAGES'!D15","v":0},{"$f":"'LISTE ENGAGES'!E15","v":0},{"$f":"'LISTE ENGAGES'!F15","v":0},{"$f":"'LISTE ENGAGES'!G15","v":7},{"$f":"'LISTE ENGAGES'!H15","v":0},{"$f":"'LISTE ENGAGES'!I15","v":0},{"$f":"'LISTE ENGAGES'!J15","v":0}]
[null,null,{"$f":"'LISTE ENGAGES'!C16","v":"T"},{"$f":"'LISTE ENGAGES'!D16","v":0},{"$f":"'LISTE ENGAGES'!E16","v":0},{"$f":"'LISTE ENGAGES'!F16","v":0},{"$f":"'LISTE ENGAGES'!G16","v":8},{"$f":"'LISTE ENGAGES'!H16","v":0},{"$f":"'LISTE ENGAGES'!I16","v":0},{"$f":"'LISTE ENGAGES'!J16","v":0}]
[null,null,{"$f":"'LISTE ENGAGES'!C17","v":"T"},{"$f":"'LISTE ENGAGES'!D17","v":0},{"$f":"'LISTE ENGAGES'!E17","v":0},{"$f":"'LISTE ENGAGES'!F17","v":0},{"$f":"'LISTE ENGAGES'!G17","v":9},{"$f":"'LISTE ENGAGES'!H17","v":0},{"$f":"'LISTE ENGAGES'!I17","v":0},{"$f":"'LISTE ENGAGES'!J17","v":0}]
[null,null,{"$f":"'LISTE ENGAGES'!C18","v":"T"},{"$f":"'LISTE ENGAGES'!D18","v":0},{"$f":"'LISTE ENGAGES'!E18","v":0},{"$f":"'LISTE ENGAGES'!F18","v":0},{"$f":"'LISTE ENGAGES'!G18","v":10},{"$f":"'LISTE ENGAGES'!H18","v":0},{"$f":"'LISTE ENGAGES'!I18","v":0},{"$f":"'LISTE ENGAGES'!J18","v":0}]
[null,null,{"$f":"'LISTE ENGAGES'!C19","v":"T"},{"$f":"'LISTE ENGAGES'!D19","v":0},{"$f":"'LISTE ENGAGES'!E19","v":0},{"$f":"'LISTE ENGAGES'!F19","v":0},{"$f":"'LISTE ENGAGES'!G19","v":11},{"$f":"'LISTE ENGAGES'!H19","v":0},{"$f":"'LISTE ENGAGES'!I19","v":0},{"$f":"'LISTE ENGAGES'!J19","v":0}]
[null,null,{"$f":"'LISTE ENGAGES'!C20","v":"T"},{"$f":"'LISTE ENGAGES'!D20","v":0},{"$f":"'LISTE ENGAGES'!E20","v":0},{"$f":"'LISTE ENGAGES'!F20","v":0},{"$f":"'LISTE ENGAGES'!G20","v":12},{"$f":"'LISTE ENGAGES'!H20","v":0},{"$f":"'LISTE ENGAGES'!I20","v":0},{"$f":"'LISTE ENGAGES'!J20","v":0}]
[null,null,{"$f":"'LISTE ENGAGES'!C21","v":"T"},{"$f":"'LISTE ENGAGES'!D21","v":0},{"$f":"'LISTE ENGAGES'!E21","v":0},{"$f":"'LISTE ENGAGES'!F21","v":0},{"$f":"'LISTE ENGAGES'!G21","v":13},{"$f":"'LISTE ENGAGES'!H21","v":0},{"$f":"'LISTE ENGAGES'!I21","v":0},{"$f":"'LISTE ENGAGES'!J21","v":0}]
[null,null,{"$f":"'LISTE ENGAGES'!C22","v":"T"},{"$f":"'LISTE ENGAGES'!D22","v":0},{"$f":"'LISTE ENGAGES'!E22","v":0},{"$f":"'LISTE ENGAGES'!F22","v":0},{"$f":"'LISTE ENGAGES'!G22","v":14},{"$f":"'LISTE ENGAGES'!H22","v":0},{"$f":"'LISTE ENGAGES'!I22","v":0},{"$f":"'LISTE ENGAGES'!J22","v":0}]
[null,null,{"$f":"'LISTE ENGAGES'!C23","v":"T"},{"$f":"'LISTE ENGAGES'!D23","v":0},{"$f":"'LISTE ENGAGES'!E23","v":0},{"$f":"'LISTE ENGAGES'!F23","v":0},{"$f":"'LISTE ENGAGES'!G23","v":15},{"$f":"'LISTE ENGAGES'!H23","v":0},{"$f":"'LISTE ENGAGES'!I23","v":0},{"$f":"'LISTE ENGAGES'!J23","v":0}]
[null,null,{"$f":"'LISTE ENGAGES'!C24","v":"T"},{"$f":"'LISTE ENGAGES'!D24","v":0},{"$f":"'LISTE ENGAGES'!E24","v":0},{"$f":"'LISTE ENGAGES'!F24","v":0},{"$f":"'LISTE ENGAGES'!G24","v":16},{"$f":"'LISTE ENGAGES'!H24","v":0},{"$f":"'LISTE ENGAGES'!I24","v":0},{"$f":"'LISTE ENGAGES'!J24","v":0}]
[null,null,{"$f":"'LISTE ENGAGES'!C25","v":"T"},{"$f":"'LISTE ENGAGES'!D25","v":0},{"$f":"'LISTE ENGAGES'!E25","v":0},{"$f":"'LISTE ENGAGES'!F25","v":0},{"$f":"'LISTE ENGAGES'!G25","v":17},{"$f":"'LISTE ENGAGES'!H25","v":0},{"$f":"'LISTE ENGAGES'!I25","v":0},{"$f":"'LISTE ENGAGES'!J25","v":0}]
[null,null,{"$f":"'LISTE ENGAGES'!C26","v":"T"},{"$f":"'LISTE ENGAGES'!D26","v":0},{"$f":"'LISTE ENGAGES'!E26","v":0},{"$f":"'LISTE ENGAGES'!F26","v":0},{"$f":"'LISTE ENGAGES'!G26","v":18},{"$f":"'LISTE ENGAGES'!H26","v":0},{"$f":"'LISTE ENGAGES'!I26","v":0},{"$f":"'LISTE ENGAGES'!J26","v":0}]
[null,null,{"$f":"'LISTE ENGAGES'!C27","v":"T"},{"$f":"'LISTE ENGAGES'!D27","v":0},{"$f":"'LISTE ENGAGES'!E27","v":0},{"$f":"'LISTE ENGAGES'!F27","v":0},{"$f":"'LISTE ENGAGES'!G27","v":19},{"$f":"'LISTE ENGAGES'!H27","v":0},{"$f":"'LISTE ENGAGES'!I27","v":0},{"$f":"'LISTE ENGAGES'!J27","v":0}]
[null,null,{"$f":"'LISTE ENGAGES'!C28","v":"T"},{"$f":"'LISTE ENGAGES'!D28","v":0},{"$f":"'LISTE ENGAGES'!E28","v":0},{"$f":"'LISTE ENGAGES'!F28","v":0},{"$f":"'LISTE ENGAGES'!G28","v":20},{"$f":"'LISTE ENGAGES'!H28","v":0},{"$f":"'LISTE ENGAGES'!I28","v":0},{"$f":"'LISTE ENGAGES'!J28","v":0}]
[null,null,{"$f":"'LISTE ENGAGES'!C29","v":"T"},{"$f":"'LISTE ENGAGES'!D29","v":0},{"$f":"'LISTE ENGAGES'!E29","v":0},{"$f":"'LISTE ENGAGES'!F29","v":0},{"$f":"'LISTE ENGAGES'!G29","v":21},{"$f":"'LISTE ENGAGES'!H29","v":0},{"$f":"'LISTE ENGAGES'!I29","v":0},{"$f":"'LISTE ENGAGES'!J29","v":0}]
[null,null,{"$f":"'LISTE ENGAGES'!C30","v":"T"},{"$f":"'LISTE ENGAGES'!D30","v":0},{"$f":"'LISTE ENGAGES'!E30","v":0},{"$f":"'LISTE ENGAGES'!F30","v":0},{"$f":"'LISTE ENGAGES'!G30","v":22},{"$f":"'LISTE ENGAGES'!H30","v":0},{"$f":"'LISTE ENGAGES'!I30","v":0},{"$f":"'LISTE ENGAGES'!J30","v":0}]
[null,null,{"$f":"'LISTE ENGAGES'!C31","v":"T"},{"$f":"'LISTE ENGAGES'!D31","v":0},{"$f":"'LISTE ENGAGES'!E31","v":0},{"$f":"'LISTE ENGAGES'!F31","v":0},{"$f":"'LISTE ENGAGES'!G31","v":23},{"$f":"'LISTE ENGAGES'!H31","v":0},{"$f":"'LISTE ENGAGES'!I31","v":0},{"$f":"'LISTE ENGAGES'!J31","v":0}]
[null,null,{"$f":"'LISTE ENGAGES'!C32","v":"T"},{"$f":"'LISTE ENGAGES'!D32","v":0},{"$f":"'LISTE ENGAGES'!E32","v":0},{"$f":"'LISTE ENGAGES'!F32","v":0},{"$f":"'LISTE ENGAGES'!G32","v":24},{"$f":"'LISTE ENGAGES'!H32","v":0},{"$f":"'LISTE ENGAGES'!I32","v":0},{"$f":"'LISTE ENGAGES'!J32","v":0}]
[null,null,{"$f":"'LISTE ENGAGES'!C33","v":"T"},{"$f":"'LISTE ENGAGES'!D33","v":0},{"$f":"'LISTE ENGAGES'!E33","v":0},{"$f":"'LISTE ENGAGES'!F33","v":0},{"$f":"'LISTE ENGAGES'!G33","v":25},{"$f":"'LISTE ENGAGES'!H33","v":0},{"$f":"'LISTE ENGAGES'!I33","v":0},{"$f":"'LISTE ENGAGES'!J33","v":0}]
[null,null,{"$f":"'LISTE ENGAGES'!C34","v":"T"},{"$f":"'LISTE ENGAGES'!D34","v":0},{"$f":"'LISTE ENGAGES'!E34","v":0},{"$f":"'LISTE ENGAGES'!F34","v":0},{"$f":"'LISTE ENGAGES'!G34","v":26},{"$f":"'LISTE ENGAGES'!H34","v":0},{"$f":"'LISTE ENGAGES'!I34","v":0},{"$f":"'LISTE ENGAGES'!J34","v":0}]
[null,null,{"$f":"'LISTE ENGAGES'!C35","v":"T"},{"$f":"'LISTE ENGAGES'!D35","v":0},{"$f":"'LISTE ENGAGES'!E35","v":0},{"$f":"'LISTE ENGAGES'!F35","v":0},{"$f":"'LISTE ENGAGES'!G35","v":27},{"$f":"'LISTE ENGAGES'!H35","v":0},{"$f":"'LISTE ENGAGES'!I35","v":0},{"$f":"'LISTE ENGAGES'!J35","v":0}]
[null,null,{"$f":"'LISTE ENGAGES'!C36","v":"T"},{"$f":"'LISTE ENGAGES'!D36","v":0},{"$f":"'LISTE ENGAGES'!E36","v":0},{"$f":"'LISTE ENGAGES'!F36","v":0},{"$f":"'LISTE ENGAGES'!G36","v":28},{"$f":"'LISTE ENGAGES'!H36","v":0},{"$f":"'LISTE ENGAGES'!I36","v":0},{"$f":"'LISTE ENGAGES'!J36","v":0}]
[null,null,{"$f":"'LISTE ENGAGES'!C37","v":"T"},{"$f":"'LISTE ENGAGES'!D37","v":0},{"$f":"'LISTE ENGAGES'!E37","v":0},{"$f":"'LISTE ENGAGES'!F37","v":0},{"$f":"'LISTE ENGAGES'!G37","v":29},{"$f":"'LISTE ENGAGES'!H37","v":0},{"$f":"'LISTE ENGAGES'!I37","v":0},{"$f":"'LISTE ENGAGES'!J37","v":0}]
[null,null,{"$f":"'LISTE ENGAGES'!C38","v":"T"},{"$f":"'LISTE ENGAGES'!D38","v":0},{"$f":"'LISTE ENGAGES'!E38","v":0},{"$f":"'LISTE ENGAGES'!F38","v":0},{"$f":"'LISTE ENGAGES'!G38","v":30},{"$f":"'LISTE ENGAGES'!H38","v":0},{"$f":"'LISTE ENGAGES'!I38","v":0},{"$f":"'LISTE ENGAGES'!J38","v":0}]
[null,null,{"$f":"'LISTE ENGAGES'!C39","v":"T"},{"$f":"'LISTE ENGAGES'!D39","v":0},{"$f":"'LISTE ENGAGES'!E39","v":0},{"$f":"'LISTE ENGAGES'!F39","v":0},{"$f":"'LISTE ENGAGES'!G39","v":31},{"$f":"'LISTE ENGAGES'!H39","v":0},{"$f":"'LISTE ENGAGES'!I39","v":0},{"$f":"'LISTE ENGAGES'!J39","v":0}]
[null,null,{"$f":"'LISTE ENGAGES'!C40","v":"T"},{"$f":"'LISTE ENGAGES'!D40","v":0},{"$f":"'LISTE ENGAGES'!E40","v":0},{"$f":"'LISTE ENGAGES'!F40","v":0},{"$f":"'LISTE ENGAGES'!G40","v":32},{"$f":"'LISTE ENGAGES'!H40","v":0},{"$f":"'LISTE ENGAGES'!I40","v":0},{"$f":"'LISTE ENGAGES'!J40","v":0}]
[null,null,{"$f":"'LISTE ENGAGES'!C41","v":"T"},{"$f":"'LISTE ENGAGES'!D41","v":0},{"$f":"'LISTE ENGAGES'!E41","v":0},{"$f":"'LISTE ENGAGES'!F41","v":0},{"$f":"'LISTE ENGAGES'!G41","v":33},{"$f":"'LISTE ENGAGES'!H41","v":0},{"$f":"'LISTE ENGAGES'!I41","v":0},{"$f":"'LISTE ENGAGES'!J41","v":0}]
[null,null,{"$f":"'LISTE ENGAGES'!C42","v":"T"},{"$f":"'LISTE ENGAGES'!D42","v":0},{"$f":"'LISTE ENGAGES'!E42","v":0},{"$f":"'LISTE ENGAGES'!F42","v":0},{"$f":"'LISTE ENGAGES'!G42","v":34},{"$f":"'LISTE ENGAGES'!H42","v":0},{"$f":"'LISTE ENGAGES'!I42","v":0},{"$f":"'LISTE ENGAGES'!J42","v":0}]
[null,null,{"$f":"'LISTE ENGAGES'!C43","v":"T"},{"$f":"'LISTE ENGAGES'!D43","v":0},{"$f":"'LISTE ENGAGES'!E43","v":0},{"$f":"'LISTE ENGAGES'!F43","v":0},{"$f":"'LISTE ENGAGES'!G43","v":35},{"$f":"'LISTE ENGAGES'!H43","v":0},{"$f":"'LISTE ENGAGES'!I43","v":0},{"$f":"'LISTE ENGAGES'!J43","v":0}]
[null,null,{"$f":"'LISTE ENGAGES'!C44","v":"T"},{"$f":"'LISTE ENGAGES'!D44","v":0},{"$f":"'LISTE ENGAGES'!E44","v":0},{"$f":"'LISTE ENGAGES'!F44","v":0},{"$f":"'LISTE ENGAGES'!G44","v":36},{"$f":"'LISTE ENGAGES'!H44","v":0},{"$f":"'LISTE ENGAGES'!I44","v":0},{"$f":"'LISTE ENGAGES'!J44","v":0}]
[null,null,{"$f":"'LISTE ENGAGES'!C45","v":"T"},{"$f":"'LISTE ENGAGES'!D45","v":0},{"$f":"'LISTE ENGAGES'!E45","v":0},{"$f":"'LISTE ENGAGES'!F45","v":0},{"$f":"'LISTE ENGAGES'!G45","v":37},{"$f":"'LISTE ENGAGES'!H45","v":0},{"$f":"'LISTE ENGAGES'!I45","v":0},{"$f":"'LISTE ENGAGES'!J45","v":0}]
[null,null,{"$f":"'LISTE ENGAGES'!C46","v":"T"},{"$f":"'LISTE ENGAGES'!D46","v":0},{"$f":"'LISTE ENGAGES'!E46","v":0},{"$f":"'LISTE ENGAGES'!F46","v":0},{"$f":"'LISTE ENGAGES'!G46","v":38},{"$f":"'LISTE ENGAGES'!H46","v":0},{"$f":"'LISTE ENGAGES'!I46","v":0},{"$f":"'LISTE ENGAGES'!J46","v":0}]
[null,null,{"$f":"'LISTE ENGAGES'!C47","v":"T"},{"$f":"'LISTE ENGAGES'!D47","v":0},{"$f":"'LISTE ENGAGES'!E47","v":0},{"$f":"'LISTE ENGAGES'!F47","v":0},{"$f":"'LISTE ENGAGES'!G47","v":39},{"$f":"'LISTE ENGAGES'!H47","v":0},{"$f":"'LISTE ENGAGES'!I47","v":0},{"$f":"'LISTE ENGAGES'!J47","v":0}]
[null,null,{"$f":"'LISTE ENGAGES'!C48","v":"T"},{"$f":"'LISTE ENGAGES'!D48","v":0},{"$f":"'LISTE ENGAGES'!E48","v":0},{"$f":"'LISTE ENGAGES'!F48","v":0},{"$f":"'LISTE ENGAGES'!G48","v":40},{"$f":"'LISTE ENGAGES'!H48","v":0},{"$f":"'LISTE ENGAGES'!I48","v":0},{"$f":"'LISTE ENGAGES'!J48","v":0}]
[null,null,{"$f":"'LISTE ENGAGES'!C49","v":"T"},{"$f":"'LISTE ENGAGES'!D49","v":0},{"$f":"'LISTE ENGAGES'!E49","v":0},{"$f":"'LISTE ENGAGES'!F49","v":0},{"$f":"'LISTE ENGAGES'!G49","v":41},{"$f":"'LISTE ENGAGES'!H49","v":0},{"$f":"'LISTE ENGAGES'!I49","v":0},{"$f":"'LISTE ENGAGES'!J49","v":0}]
[null,null,{"$f":"'LISTE ENGAGES'!C50","v":"T"},{"$f":"'LISTE ENGAGES'!D50","v":0},{"$f":"'LISTE ENGAGES'!E50","v":0},{"$f":"'LISTE ENGAGES'!F50","v":0},{"$f":"'LISTE ENGAGES'!G50","v":42},{"$f":"'LISTE ENGAGES'!H50","v":0},{"$f":"'LISTE ENGAGES'!I50","v":0},{"$f":"'LISTE ENGAGES'!J50","v":0}]
[null,null,{"$f":"'LISTE ENGAGES'!C51","v":"T"},{"$f":"'LISTE ENGAGES'!D51","v":0},{"$f":"'LISTE ENGAGES'!E51","v":0},{"$f":"'LISTE ENGAGES'!F51","v":0},{"$f":"'LISTE ENGAGES'!G51","v":43},{"$f":"'LISTE ENGAGES'!H51","v":0},{"$f":"'LISTE ENGAGES'!I51","v":0},{"$f":"'LISTE ENGAGES'!J51","v":0}]
[null,null,{"$f":"'LISTE ENGAGES'!C52","v":"T"},{"$f":"'LISTE ENGAGES'!D52","v":0},{"$f":"'LISTE ENGAGES'!E52","v":0},{"$f":"'LISTE ENGAGES'!F52","v":0},{"$f":"'LISTE ENGAGES'!G52","v":44},{"$f":"'LISTE ENGAGES'!H52","v":0},{"$f":"'LISTE ENGAGES'!I52","v":0},{"$f":"'LISTE ENGAGES'!J52","v":0}]
[null,null,{"$f":"'LISTE ENGAGES'!C53","v":"T"},{"$f":"'LISTE ENGAGES'!D53","v":0},{"$f":"'LISTE ENGAGES'!E53","v":0},{"$f":"'LISTE ENGAGES'!F53","v":0},{"$f":"'LISTE ENGAGES'!G53","v":45},{"$f":"'LISTE ENGAGES'!H53","v":0},{"$f":"'LISTE ENGAGES'!I53","v":0},{"$f":"'LISTE ENGAGES'!J53","v":0}]
[null,null,{"$f":"'LISTE ENGAGES'!C54","v":"T"},{"$f":"'LISTE ENGAGES'!D54","v":0},{"$f":"'LISTE ENGAGES'!E54","v":0},{"$f":"'LISTE ENGAGES'!F54","v":0},{"$f":"'LISTE ENGAGES'!G54","v":46},{"$f":"'LISTE ENGAGES'!H54","v":0},{"$f":"'LISTE ENGAGES'!I54","v":0},{"$f":"'LISTE ENGAGES'!J54","v":0}]
[null,null,{"$f":"'LISTE ENGAGES'!C55","v":"T"},{"$f":"'LISTE ENGAGES'!D55","v":0},{"$f":"'LISTE ENGAGES'!E55","v":0},{"$f":"'LISTE ENGAGES'!F55","v":0},{"$f":"'LISTE ENGAGES'!G55","v":47},{"$f":"'LISTE ENGAGES'!H55","v":0},{"$f":"'LISTE ENGAGES'!I55","v":0},{"$f":"'LISTE ENGAGES'!J55","v":0}]
[null,null,{"$f":"'LISTE ENGAGES'!C56","v":"T"},{"$f":"'LISTE ENGAGES'!D56","v":0},{"$f":"'LISTE ENGAGES'!E56","v":0},{"$f":"'LISTE ENGAGES'!F56","v":0},{"$f":"'LISTE ENGAGES'!G56","v":48},{"$f":"'LISTE ENGAGES'!H56","v":0},{"$f":"'LISTE ENGAGES'!I56","v":0},{"$f":"'LISTE ENGAGES'!J56","v":0}]
[]
[]
[]
[]
[]
[]
[]
[null,null,"REMARQUES :"]
[]
[]
[]
[]
[]
[]
[]
[]
[null,null,"SIGNATURES :"]