{"text_format":"1","workbook":"xlsx","n_sheets":5,"sheets":["EMARGEMENT","TAB RES","SCORE","RELEVE","LISTE"],"not_rendered":{"charts":0,"images":6,"macros":1,"external_links":0,"defined_names":19,"comments":0,"pivot_tables":0},"unopened":[],"bounds":{"document_bytes":16777216,"sheet_cells":100000,"rows_first":2000,"rows_last":500,"rows_between":2000,"halvings":0,"cell_chars":16384,"cell_head_chars":4096},"cells_cut":0,"cells_raw":0,"read":"whole","date_system":"1900"}

{"sheet":"EMARGEMENT","index":0,"n_rows":29,"n_cols":20,"rows_kept":29,"cut":false,"hidden":false,"merged":[[11,16,11,20],[12,16,12,20],[1,13,3,13],[4,3,4,13],[5,3,5,13],[1,3,2,12],[3,3,3,6],[3,7,3,11]]}
[]
[null,null,null,{"$f":"IF(T3=\"\",S3,T3)","v":"APPELATION TOURNOI"},null,null,null,null,null,null,null,null,null,"ORGANISATEUR",null,null,null,null,null,"IDENTITE DU TOURNOI"]
[null,null,null,null,null,null,null,null,null,null,null,null,null,null,null,null,null,null,"APPELATION TOURNOI"]
[null,null,null,{"$f":"IF(T4=\"\",S4,T4)","v":"LIEU"},null,null,null,{"$f":"IF(T6=\"\",\"DATE\",CONCATENATE(T7,\"-\",T8,\"/\",T6))","v":"DATE"},null,null,null,null,{"$f":"IF(T9=\"\",S9,T9)","v":"GENRE"},null,null,null,null,null,"LIEU"]
[null,null,null,{"$f":"IF(T5=\"\",S5,T5)","v":"TYPE"},null,null,null,null,null,null,null,null,null,null,null,null,null,null,"TYPE"]
[null,null,null,"FEUILLE EMARGEMENT",null,null,null,null,null,null,null,null,null,null,null,null,null,null,"ANNEE"]
[null,null,null,null,null,null,null,null,null,null,null,null,null,null,null,null,null,null,"DATE DEBUT"]
[null,null,null,null,null,null,null,null,null,null,null,null,null,null,null,null,null,null,"DATE FIN"]
["N°",null,"NOM","PRENOM","LICENCE","CLUB","NOM","PRENOM","LICENCE","CLUB","pts","tir","SIGNATURE JOUEUR1","SIGNATURE JOUEUR2","PAIEMENT",null,null,null,"GENRE"]
[1,null,"T",null,null,null,1,null,null,null,null,null,null,null,null,null,null,null,"ORGANISATEUR"]
[2,null,"T",null,null,null,2]
[3,null,"T",null,null,null,3,null,null,null,null,null,null,null,null,null,"1- Commencez par renseigner le tableau ci-dessus \"identité du tournoi\""]
[4,null,"T",null,null,null,4,null,null,null,null,null,null,null,null,null,"2- Copiez-collez la liste des équipes engagés dans les champs ci-contre en respectant : "]
[5,null,"T",null,null,null,5,null,null,null,null,null,null,null,null,null,"- nom et premon séparés pour chaque joueur ( à défaut, ne mentionez que le nom)"]
[6,null,"T",null,null,null,6,null,null,null,null,null,null,null,null,null,"- l'ordre décroissant des têtes de séries"]
[7,null,"T",null,null,null,7,null,null,null,null,null,null,null,null,null,"3- Saisissez les scores dans l'onglet \"TAB RES\""]
[8,null,"T",null,null,null,8,null,null,null,null,null,null,null,null,null,"4- Renseignez l'onglet \"RELEVE\" à l'issue du tournoi"]
[]
[]
[]
[]
[]
[]
[]
[]
[]
[null,null,"Copier/coller selon LISTE ENGAGES en fonction des équipes confirmées"]
[null,null,"ATTENTION : Respecter l'ordre des têtes de séries."]
[null,null,"Ex: Si Sur LISTE ENGAGES, l'équipe 6 absente, la numéro 7 devient la numéro 6 dans EMARG"]

{"sheet":"TAB RES","index":1,"n_rows":65,"n_cols":37,"rows_kept":65,"cut":false,"hidden":false,"merged":[[34,19,34,23],[9,14,9,15],[28,8,28,11],[29,9,29,12],[30,9,30,12],[31,9,31,12],[34,9,34,12],[1,20,4,27],[1,28,10,35],[4,14,4,18],[5,2,5,27],[32,9,32,12],[7,19,7,23],[25,1,25,2],[1,2,4,4],[1,5,3,19],[4,5,4,13],[8,8,8,15],[9,10,9,11],[9,12,9,13],[7,9,7,15],[35,9,35,12],[36,9,36,12],[11,0,14,0],[18,0,21,0],[9,3,9,4],[23,3,23,4],[33,9,33,12]]}
[]
[null,null,null,null,null,{"$f":"EMARGEMENT!D2","v":"APPELATION TOURNOI"},null,null,null,null,null,null,null,null,null,null,null,null,null,null,{"$f":"EMARGEMENT!N2","v":"ORGANISATEUR"}]
[]
[]
[null,null,null,null,null,{"$f":"EMARGEMENT!D4","v":"LIEU"},null,null,null,null,null,null,null,null,{"$f":"EMARGEMENT!H4","v":"DATE"},null,null,null,null,{"$f":"EMARGEMENT!M4","v":"GENRE"}]
[null,null,{"$f":"EMARGEMENT!D5","v":"TYPE"}]
[]
[null,null,"POULES",null,null,null,null,null,null,"RESULTATS",null,null,null,null,null,null,null,null,null,"1/4 FINALE"]
[]
[null,null,null,"Ordre",null,"Heure","Terrain","Arbitre",null,"Score","Set 1",null,"Set 2",null,"Set 3",null,null,null,null,{"$f":"C30","v":""},"Score","S1","S2","S3","Heure","Terrain","Arbitre"]
[null,null,null,"TS1-TS8","(1)","9h00","1","B3",null,{"$f":"CONCATENATE(SCORE!K8,\" / \",SCORE!M8)","v":"0 / 0"},null,null,null,null,null,null,null,null,null,"1A                       (13)",{"$f":"IF(V11=V12,\"\",SUM(IF(V11>V12,1,0),IF(W11>W12,1,0),IF(X11<=X12,0,1)))","v":""}]
["A","TS1",{"$f":"CONCATENATE(EMARGEMENT!C10,\" / \",EMARGEMENT!G10)","v":"T / 1"},"TS4-TS5","(3)","9h45","1","B1",null,{"$f":"CONCATENATE(SCORE!K10,\" / \",SCORE!M10)","v":"0 / 0"},null,null,null,null,null,null,null,null,null,"4B",{"$f":"IF(V11=V12,\"\",SUM(IF(V11<V12,1,0),IF(W11<W12,1,0),IF(X11>=X12,0,1)))","v":""}]
[null,"TS4",{"$f":"CONCATENATE(EMARGEMENT!C13,\" / \",EMARGEMENT!G13)","v":"T / 4"},"TS4-TS8","(5)","10h30","1","B3",null,{"$f":"CONCATENATE(SCORE!K12,\" / \",SCORE!M12)","v":"0 / 0"},null,null,null,null,null,null,null,null,null,{"$f":"C40","v":""}]
[null,"TS5",{"$f":"CONCATENATE(EMARGEMENT!C14,\" / \",EMARGEMENT!G14)","v":"T / 5"},"TS1-TS5","(7)","11h15","1","B4",null,{"$f":"CONCATENATE(SCORE!K14,\" / \",SCORE!M14)","v":"0 / 0"}]
[null,"TS8",{"$f":"CONCATENATE(EMARGEMENT!C17,\" / \",EMARGEMENT!G17)","v":"T / 8"},"TS5-TS8","(9)","12h00","1","B2",null,{"$f":"CONCATENATE(SCORE!K16,\" / \",SCORE!M16)","v":"0 / 0"}]
[null,null,null,"TS1-TS4","(11)","12h45","1","B4",null,{"$f":"CONCATENATE(SCORE!K18,\" / \",SCORE!M18)","v":"0 / 0"},null,null,null,null,null,null,null,null,null,{"$f":"C32","v":""},"Score","S1","S2","S3","Heure","Terrain","Arbitre"]
[null,null,null,null,null,null,null,null,null,null,null,null,null,null,null,null,null,null,null,"3A                       (14)",{"$f":"IF(V17=V18,\"\",SUM(IF(V17>V18,1,0),IF(W17>W18,1,0),IF(X17<=X18,0,1)))","v":""}]
[null,null,null,"TS2-TS7","(2)","9h00","2","3",null,{"$f":"CONCATENATE(SCORE!K9,\" / \",SCORE!M9)","v":"0 / 0"},null,null,null,null,null,null,null,null,null,"2B",{"$f":"IF(V17=V18,\"\",SUM(IF(V17<V18,1,0),IF(W17<W18,1,0),IF(X17>=X18,0,1)))","v":""}]
["B","TS2",{"$f":"CONCATENATE(EMARGEMENT!C11,\" / \",EMARGEMENT!G11)","v":"T / 2"},"TS3-TS6","(4)","9h45","2","A1",null,{"$f":"CONCATENATE(SCORE!K11,\" / \",SCORE!M11)","v":"0 / 0"},null,null,null,null,null,null,null,null,null,{"$f":"C38","v":""}]
[null,"TS3",{"$f":"CONCATENATE(EMARGEMENT!C12,\" / \",EMARGEMENT!G12)","v":"T / 3"},"TS3-TS7","(6)","10h30","2","A3",null,{"$f":"CONCATENATE(SCORE!K13,\" / \",SCORE!M13)","v":"0 / 0"}]
[null,"TS6",{"$f":"CONCATENATE(EMARGEMENT!C15,\" / \",EMARGEMENT!G15)","v":"T / 6"},"TS2-TS6","(8)","11h15","2","A4",null,{"$f":"CONCATENATE(SCORE!K15,\" / \",SCORE!M15)","v":"0 / 0"}]
[null,"TS7",{"$f":"CONCATENATE(EMARGEMENT!C16,\" / \",EMARGEMENT!G16)","v":"T / 7"},"TS6-TS7","(10)","12h00","2","A2",null,{"$f":"CONCATENATE(SCORE!K17,\" / \",SCORE!M17)","v":"0 / 0"},null,null,null,null,null,null,null,null,null,{"$f":"C31","v":""},"Score","S1","S2","S3","Heure","Terrain","Arbitre"]
[null,null,null,"TS2-TS3","(12)","12h45","2","A4",null,{"$f":"CONCATENATE(SCORE!K19,\" / \",SCORE!M19)","v":"0 / 0"},null,null,null,null,null,null,null,null,null,"2A                       (15)",{"$f":"IF(V23=V24,\"\",SUM(IF(V23>V24,1,0),IF(W23>W24,1,0),IF(X23<=X24,0,1)))","v":""}]
[null,null,null,"Ordre",null,"Heure","Terrain","Arbitre",null,null,null,null,null,null,null,null,null,null,null,"3B",{"$f":"IF(V23=V24,\"\",SUM(IF(V23<V24,1,0),IF(W23<W24,1,0),IF(X23>=X24,0,1)))","v":""}]
[null,null,null,null,null,null,null,null,null,"SAISIR UNIQUEMENT LES RESULTATS",null,null,null,null,null,null,null,null,null,{"$f":"C39","v":""}]
[null,"CLASSEMENT POULE",null,null,null,null,null,null,null,"DES SETS DANS LES CELLULES GRISEES"]
[]
[null,null,null,null,null,null,null,null,null,null,null,null,null,null,null,null,null,null,null,{"$f":"C33","v":""},"Score","S1","S2","S3","Heure","Terrain","Arbitre"]
[null,null,null,null,null,null,null,null,"CLASSEMENT FINAL",null,null,null,null,null,null,null,null,null,null,"4A                       (16)",{"$f":"IF(V29=V30,\"\",SUM(IF(V29>V30,1,0),IF(W29>W30,1,0),IF(X29<=X30,0,1)))","v":""}]
[null,1,{"$f":"SCORE!AJ8","v":""},null,null,null,null,null,1,{"$f":"AK47","v":" "},null,null,null,null,null,null,null,null,null,"1B",{"$f":"IF(V29=V30,\"\",SUM(IF(V29<V30,1,0),IF(W29<W30,1,0),IF(X29>=X30,0,1)))","v":""}]
[null,2,{"$f":"SCORE!AJ9","v":""},null,null,null,null,null,2,{"$f":"IF(AD47=AD48,\" \",IF(AD47<AD48,AC41,AC54))","v":" "},null,null,null,null,null,null,null,null,null,{"$f":"C37","v":""}]
[null,3,{"$f":"SCORE!AJ10","v":""},null,null,null,null,null,3,{"$f":"AK62","v":" "}]
[null,4,{"$f":"SCORE!AJ11","v":""},null,null,null,null,null,4,{"$f":"IF(AD62=AD63,\" \",IF(AD62<AD63,AC59,AC65))","v":" "}]
[null,null,null,null,null,null,null,null,5,{"$f":"IF(U11=U12,\" \",IF(U11<U12,T10,T13))","v":" "}]
[null,null,null,null,null,null,null,null,6,{"$f":"IF(U17=U18,\" \",IF(U17<U18,T16,T19))","v":" "},null,null,null,null,null,null,null,null,null,"1/2 FINALE",null,null,null,null,null,null,null,null,"FINALE"]
[null,null,null,null,null,null,null,null,7,{"$f":"IF(U23=U24,\" \",IF(U23<U24,T22,T25))","v":" "}]
[null,1,{"$f":"SCORE!AJ13","v":""},null,null,null,null,null,8,{"$f":"IF(U29=U30,\" \",IF(U29<U30,T28,T31))","v":" "}]
[null,2,{"$f":"SCORE!AJ14","v":""},null,null,null,null,null,null,null,null,null,null,null,null,null,null,null,null,{"$f":"IF(U11=U12,\" \",IF(U11>U12,T10,T13))","v":" "}]
[null,3,{"$f":"SCORE!AJ15","v":""}]
[null,4,{"$f":"SCORE!AJ16","v":""},null,null,null,null,null,null,null,null,null,null,null,null,null,null,null,null,null,"Score","S1","S2","S3","Heure","Terrain","Arbitre"]
[null,null,null,null,null,null,null,null,null,null,null,null,null,null,null,null,null,null,null,"(17)",{"$f":"IF(V41=V42,\"\",SUM(IF(V41>V42,1,0),IF(W41>W42,1,0),IF(X41<=X42,0,1)))","v":""},null,null,null,null,null,null,null,{"$f":"IF(U41=U42,\" \",IF(U41>U42,T38,T45))","v":" "}]
[null,null,null,null,null,null,null,null,null,null,null,null,null,null,null,null,null,null,null,null,{"$f":"IF(V41=V42,\"\",SUM(IF(V41<V42,1,0),IF(W41<W42,1,0),IF(X41>=X42,0,1)))","v":""}]
[]
[null,null,null,null,null,null,null,null,null,null,null,null,null,null,null,null,null,null,null,null,null,null,null,null,null,null,null,null,null,null,null,null,"(20)"]
[null,null,null,null,null,null,null,null,null,null,null,null,null,null,null,null,null,null,null,{"$f":"IF(U17=U18,\" \",IF(U17>U18,T16,T19))","v":" "}]
[null,null,null,null,null,null,null,null,null,null,null,null,null,null,null,null,null,null,null,null,null,null,null,null,null,null,null,null,null,"Score","S1","S2","S3","Heure","Terrain","Arbitre"]
[null,null,null,null,null,null,null,null,null,null,null,null,null,null,null,null,null,null,null,null,null,null,null,null,null,null,null,null,null,{"$f":"IF(AE47=AE48,\"\",SUM(IF(AE47>AE48,1,0),IF(AF47>AF48,1,0),IF(AG47<=AG48,0,1)))","v":""},null,null,null,null,null,null,{"$f":"IF(AD47=AD48,\" \",IF(AD47>AD48,AC41,AC54))","v":" "}]
[null,null,null,null,null,null,null,null,null,null,null,null,null,null,null,null,null,null,null,null,null,null,null,null,null,null,null,null,null,{"$f":"IF(AE47=AE48,\"\",SUM(IF(AE47<AE48,1,0),IF(AF47<AF48,1,0),IF(AG47>=AG48,0,1)))","v":""}]
[]
[null,null,null,null,null,null,null,null,null,null,null,null,null,null,null,null,null,null,null,{"$f":"IF(U23=U24,\" \",IF(U23>U24,T22,T25))","v":" "}]
[]
[]
[null,null,null,null,null,null,null,null,null,null,null,null,null,null,null,null,null,null,null,null,"Score","S1","S2","S3","Heure","Terrain","Arbitre"]
[null,null,null,null,null,null,null,null,null,null,null,null,null,null,null,null,null,null,null,"(18)",{"$f":"IF(V54=V55,\"\",SUM(IF(V54>V55,1,0),IF(W54>W55,1,0),IF(X54<=X55,0,1)))","v":""},null,null,null,null,null,null,null,{"$f":"IF(U54=U55,\" \",IF(U54>U55,T50,T57))","v":" "}]
[null,null,null,null,null,null,null,null,null,null,null,null,null,null,null,null,null,null,null,null,{"$f":"IF(V54=V55,\"\",SUM(IF(V54<V55,1,0),IF(W54<W55,1,0),IF(X54>=X55,0,1)))","v":""}]
[]
[null,null,null,null,null,null,null,null,null,null,null,null,null,null,null,null,null,null,null,{"$f":"IF(U29=U30,\" \",IF(U29>U30,T28,T31))","v":" "},null,null,null,null,null,null,null,null,"PLACE 3/4"]
[]
[null,null,null,null,null,null,null,null,null,null,null,null,null,null,null,null,null,null,null,null,null,null,null,null,null,null,null,null,{"$f":"IF(U41=U42,\" \",IF(U41>U42,T45,T38))","v":" "}]
[]
[null,null,null,null,null,null,null,null,null,null,null,null,null,null,null,null,null,null,null,null,null,null,null,null,null,null,null,null,null,"Score","S1","S2","S3","Heure","Terrain","Arbitre"]
[null,null,null,null,null,null,null,null,null,null,null,null,null,null,null,null,null,null,null,null,null,null,null,null,null,null,null,null,"(19)",{"$f":"IF(AE62=AE63,\"\",SUM(IF(AE62>AE63,1,0),IF(AF62>AF63,1,0),IF(AG62<=AG63,0,1)))","v":""},null,null,null,null,null,null,{"$f":"IF(AD62=AD63,\" \",IF(AD62>AD63,AC59,AS38))","v":" "}]
[null,null,null,null,null,null,null,null,null,null,null,null,null,null,null,null,null,null,null,null,null,null,null,null,null,null,null,null,null,{"$f":"IF(AE62=AE63,\"\",SUM(IF(AE62<AE63,1,0),IF(AF62<AF63,1,0),IF(AG62>=AG63,0,1)))","v":""}]
[]
[null,null,null,null,null,null,null,null,null,null,null,null,null,null,null,null,null,null,null,null,null,null,null,null,null,null,null,null,{"$f":"IF(U54=U55,\" \",IF(U54>U55,T57,T50))","v":" "}]

{"sheet":"SCORE","index":2,"n_rows":25,"n_cols":36,"rows_kept":25,"cut":false,"hidden":true,"merged":[]}
[]
[]
["DEBUT J1","09:00:00"]
["TEMPS","00:45:00"]
["DEBUT J2","14:00:00"]
[]
[null,null,"PHASE","JOUR","N° MATCH","HEURE","TER","EQ1",null,"EQ2","SCORE EQ1",null,"SCORE EQ2","SET 1 EQ1","SET 1 EQ2","SET 2 EQ1","SET 2 EQ2","SET 3 EQ1","SET 3 EQ2","POS 1","POS 2",null,null,null,null,"PTS","S+","S-","P+","P-","CS","CP","CLA","RG",null,"CLA DEF"]
["POULE A","POULE B","A",1,1,{"$f":"B3","v":"09:00:00"},1,{"$f":"'TAB RES'!C12","v":"T / 1"},"/",{"$f":"'TAB RES'!C15","v":"T / 8"},{"$f":"SUM(IF(N8>O8,1,0),IF(P8>Q8,1,0),IF(R8>S8,1,0))","v":0},"/",{"$f":"SUM(IF(O8>N8,1,0),IF(Q8>P8,1,0),IF(S8>R8,1,0))","v":0},{"$f":"'TAB RES'!K11","v":0},{"$f":"'TAB RES'!L11","v":0},{"$f":"'TAB RES'!M11","v":0},{"$f":"'TAB RES'!N11","v":0},{"$f":"'TAB RES'!O11","v":0},{"$f":"'TAB RES'!P11","v":0},{"$f":"IF(K8=M8,\"\",IF(K8>M8,H8,J8))","v":""},{"$f":"IF(K8=M8,\"\",IF(K8<M8,H8,J8))","v":""},null,null,"A",{"$f":"'TAB RES'!C12","v":"T / 1"},{"$f":"COUNTIF(PLACE1,Y8)*2+COUNTIF(U8:U19,Y8)","v":0},{"$f":"SUMIF(LISTEE1,Y8,(SCEQ1))+SUMIF(LISTEE2,Y8,(SCEQ2))","v":0},{"$f":"SUMIF(LISTEE1,Y8,(SCEQ2))+SUMIF(LISTEE2,Y8,(SCEQ1))","v":0},{"$f":"(SUMPRODUCT((LISTEE1=Y8)*((S1EQ1)+(S2EQ1)+(S3EQ1))))+(SUMPRODUCT((LISTEE2=Y8)*((S1EQ2)+(S2EQ2)+(S3EQ3))))","v":0},{"$f":"(SUMPRODUCT((LISTEE2=Y8)*((S1EQ1)+(S2EQ1)+(S3EQ1))))+(SUMPRODUCT((LISTEE1=Y8)*((S1EQ2)+(S2EQ2)+(S3EQ3))))","v":0},{"$f":"IFERROR(AA8/AB8,0)","v":0},{"$f":"IFERROR(AC8/AD8,0)","v":0},{"$f":"Z8+AE8/100+AF8/100","v":0},{"$f":"RANK(AG8,AG8:AG11)","v":1},1,{"$f":"IF(Z8=0,\"\",IF(AH8=AI8,Y8,IF(AH9=AI8,Y9,IF(AH10=AI8,Y10,IF(AH11=AI8,Y11)))))","v":""}]
["A1","B1","B",1,2,{"$f":"B3","v":"09:00:00"},2,{"$f":"'TAB RES'!C19","v":"T / 2"},"/",{"$f":"'TAB RES'!C22","v":"T / 7"},0,"/",0,{"$f":"'TAB RES'!K18","v":0},{"$f":"'TAB RES'!L18","v":0},{"$f":"'TAB RES'!M18","v":0},{"$f":"'TAB RES'!N18","v":0},{"$f":"'TAB RES'!O18","v":0},{"$f":"'TAB RES'!P18","v":0},{"$f":"IF(K9=M9,\"\",IF(K9>M9,H9,J9))","v":""},{"$f":"IF(K9=M9,\"\",IF(K9<M9,H9,J9))","v":""},null,null,null,{"$f":"'TAB RES'!C13","v":"T / 4"},{"$f":"COUNTIF(PLACE1,Y9)*2+COUNTIF(U8:U19,Y9)","v":0},{"$f":"SUMIF(LISTEE1,Y9,(SCEQ1))+SUMIF(LISTEE2,Y9,(SCEQ2))","v":0},{"$f":"SUMIF(LISTEE1,Y9,(SCEQ2))+SUMIF(LISTEE2,Y9,(SCEQ1))","v":0},{"$f":"(SUMPRODUCT((LISTEE1=Y9)*((S1EQ1)+(S2EQ1)+(S3EQ1))))+(SUMPRODUCT((LISTEE2=Y9)*((S1EQ2)+(S2EQ2)+(S3EQ3))))","v":0},{"$f":"(SUMPRODUCT((LISTEE2=Y9)*((S1EQ1)+(S2EQ1)+(S3EQ1))))+(SUMPRODUCT((LISTEE1=Y9)*((S1EQ2)+(S2EQ2)+(S3EQ3))))","v":0},{"$f":"IFERROR(AA9/AB9,0)","v":0},{"$f":"IFERROR(AC9/AD9,0)","v":0},{"$f":"Z9+AE9/100+AF9/100","v":0},{"$f":"RANK(AG9,AG8:AG11)","v":1},2,{"$f":"IF(Z9=0,\"\",IF(AH8=AI9,Y8,IF(AH9=AI9,Y9,IF(AH10=AI9,Y10,IF(AH11=AI9,Y11)))))","v":""}]
["A2","B2","A",1,3,{"$f":"F8+$B$4","v":"09:45:00"},1,{"$f":"'TAB RES'!C13","v":"T / 4"},"/",{"$f":"'TAB RES'!C14","v":"T / 5"},0,"/",0,{"$f":"'TAB RES'!K12","v":0},{"$f":"'TAB RES'!L12","v":0},{"$f":"'TAB RES'!M12","v":0},{"$f":"'TAB RES'!N12","v":0},{"$f":"'TAB RES'!O12","v":0},{"$f":"'TAB RES'!P12","v":0},{"$f":"IF(K10=M10,\"\",IF(K10>M10,H10,J10))","v":""},"",null,null,null,{"$f":"'TAB RES'!C14","v":"T / 5"},{"$f":"COUNTIF(PLACE1,Y10)*2+COUNTIF(U8:U19,Y10)","v":0},0,0,0,0,0,0,0,{"$f":"RANK(AG10,AG8:AG11)","v":1},3,{"$f":"IF(Z10=0,\"\",IF(AH8=AI10,Y8,IF(AH9=AI10,Y9,IF(AH10=AI10,Y10,IF(AH11=AI10,Y11)))))","v":""}]
["A3","B3","B",1,4,{"$f":"F9+$B$4","v":"09:45:00"},2,{"$f":"'TAB RES'!C20","v":"T / 3"},"/",{"$f":"'TAB RES'!C21","v":"T / 6"},0,"/",0,{"$f":"'TAB RES'!K19","v":0},{"$f":"'TAB RES'!L19","v":0},{"$f":"'TAB RES'!M19","v":0},{"$f":"'TAB RES'!N19","v":0},{"$f":"'TAB RES'!O19","v":0},{"$f":"'TAB RES'!P19","v":0},"","",null,null,null,{"$f":"'TAB RES'!C15","v":"T / 8"},{"$f":"COUNTIF(PLACE1,Y11)*2+COUNTIF(U8:U19,Y11)","v":0},0,0,0,0,0,0,0,{"$f":"RANK(AG11,AG8:AG11)","v":1},4,{"$f":"IF(Z11=0,\"\",IF(AH8=AI11,Y8,IF(AH9=AI11,Y9,IF(AH10=AI11,Y10,IF(AH11=AI11,Y11)))))","v":""}]
["A4","B4","A",1,5,"10:30:00",1,{"$f":"'TAB RES'!C13","v":"T / 4"},"/",{"$f":"'TAB RES'!C15","v":"T / 8"},0,"/",0,{"$f":"'TAB RES'!K13","v":0},{"$f":"'TAB RES'!L13","v":0},{"$f":"'TAB RES'!M13","v":0},{"$f":"'TAB RES'!N13","v":0},{"$f":"'TAB RES'!O13","v":0},{"$f":"'TAB RES'!P13","v":0},"",""]
[null,null,"B",1,6,"10:30:00",2,{"$f":"'TAB RES'!C20","v":"T / 3"},"/",{"$f":"'TAB RES'!C22","v":"T / 7"},0,"/",0,{"$f":"'TAB RES'!K20","v":0},{"$f":"'TAB RES'!L20","v":0},{"$f":"'TAB RES'!M20","v":0},{"$f":"'TAB RES'!N20","v":0},{"$f":"'TAB RES'!O20","v":0},{"$f":"'TAB RES'!P20","v":0},"","",null,null,"B",{"$f":"'TAB RES'!C19","v":"T / 2"},{"$f":"COUNTIF(PLACE1,Y13)*2+COUNTIF(U8:U19,Y13)","v":0},0,0,0,0,0,{"$f":"IFERROR(AC13/AD13,0)","v":0},0,{"$f":"RANK(AG13,AG13:AG16)","v":1},1,{"$f":"IF(Z13=0,\"\",IF(AH13=AI13,Y13,IF(AH14=AI13,Y14,IF(AH15=AI13,Y15,IF(AH16=AI13,Y16)))))","v":""}]
[null,null,"A",1,7,"11:15:00",1,{"$f":"'TAB RES'!C12","v":"T / 1"},"/",{"$f":"'TAB RES'!C14","v":"T / 5"},0,"/",0,{"$f":"'TAB RES'!K14","v":0},{"$f":"'TAB RES'!L14","v":0},{"$f":"'TAB RES'!M14","v":0},{"$f":"'TAB RES'!N14","v":0},{"$f":"'TAB RES'!O14","v":0},{"$f":"'TAB RES'!P14","v":0},{"$f":"IF(K14=M14,\"\",IF(K14>M14,H14,J14))","v":""},"",null,null,null,{"$f":"'TAB RES'!C20","v":"T / 3"},{"$f":"COUNTIF(PLACE1,Y14)*2+COUNTIF(U8:U19,Y14)","v":0},0,0,0,0,0,0,0,{"$f":"RANK(AG14,AG13:AG16)","v":1},2,{"$f":"IF(Z14=0,\"\",IF(AH13=AI14,Y13,IF(AH14=AI14,Y14,IF(AH15=AI14,Y15,IF(AH16=AI14,Y16)))))","v":""}]
[null,null,"B",1,8,"11:15:00",2,{"$f":"'TAB RES'!C19","v":"T / 2"},"/",{"$f":"'TAB RES'!C21","v":"T / 6"},0,"/",0,{"$f":"'TAB RES'!K21","v":0},{"$f":"'TAB RES'!L21","v":0},{"$f":"'TAB RES'!M21","v":0},{"$f":"'TAB RES'!N21","v":0},{"$f":"'TAB RES'!O21","v":0},{"$f":"'TAB RES'!P21","v":0},"","",null,null,null,{"$f":"'TAB RES'!C21","v":"T / 6"},{"$f":"COUNTIF(PLACE1,Y15)*2+COUNTIF(U8:U19,Y15)","v":0},0,0,0,0,0,0,0,{"$f":"RANK(AG15,AG13:AG17)","v":1},3,{"$f":"IF(Z15=0,\"\",IF(AH13=AI15,Y13,IF(AH14=AI15,Y14,IF(AH15=AI15,Y15,IF(AH16=AI15,Y16)))))","v":""}]
[null,null,"A",1,9,"12:00:00",1,{"$f":"'TAB RES'!C14","v":"T / 5"},"/",{"$f":"'TAB RES'!C15","v":"T / 8"},0,"/",0,{"$f":"'TAB RES'!K15","v":0},{"$f":"'TAB RES'!L15","v":0},{"$f":"'TAB RES'!M15","v":0},{"$f":"'TAB RES'!N15","v":0},{"$f":"'TAB RES'!O15","v":0},{"$f":"'TAB RES'!P15","v":0},"","",null,null,null,{"$f":"'TAB RES'!C22","v":"T / 7"},{"$f":"COUNTIF(PLACE1,Y16)*2+COUNTIF(U8:U19,Y16)","v":0},0,0,0,0,0,0,0,{"$f":"RANK(AG16,AG13:AG17)","v":1},4,{"$f":"IF(Z16=0,\"\",IF(AH13=AI16,Y13,IF(AH14=AI16,Y14,IF(AH15=AI16,Y15,IF(AH16=AI16,Y16)))))","v":""}]
[null,null,"B",1,10,"12:00:00",2,{"$f":"'TAB RES'!C21","v":"T / 6"},"/",{"$f":"'TAB RES'!C22","v":"T / 7"},0,"/",0,{"$f":"'TAB RES'!K22","v":0},{"$f":"'TAB RES'!L22","v":0},{"$f":"'TAB RES'!M22","v":0},{"$f":"'TAB RES'!N22","v":0},{"$f":"'TAB RES'!O22","v":0},{"$f":"'TAB RES'!P22","v":0},"",""]
[null,null,"A",1,11,"12:45:00",1,{"$f":"'TAB RES'!C12","v":"T / 1"},"/",{"$f":"'TAB RES'!C13","v":"T / 4"},0,"/",0,{"$f":"'TAB RES'!K16","v":0},{"$f":"'TAB RES'!L16","v":0},{"$f":"'TAB RES'!M16","v":0},{"$f":"'TAB RES'!N16","v":0},{"$f":"'TAB RES'!O16","v":0},{"$f":"'TAB RES'!P16","v":0},"",""]
[null,null,"B",1,12,"12:45:00",2,{"$f":"'TAB RES'!C19","v":"T / 2"},"/",{"$f":"'TAB RES'!C20","v":"T / 3"},0,"/",0,{"$f":"'TAB RES'!K23","v":0},{"$f":"'TAB RES'!L23","v":0},{"$f":"'TAB RES'!M23","v":0},{"$f":"'TAB RES'!N23","v":0},{"$f":"'TAB RES'!O23","v":0},{"$f":"'TAB RES'!P23","v":0},"",""]
[null,null,"BAR",1,13,{"$f":"B5","v":"14:00:00"},1,{"$f":"AJ14","v":""},"/",{"$f":"AJ10","v":""},{"$f":"SUM(IF(N20>O20,1,0),IF(P20>Q20,1,0),IF(R20>S20,1,0))","v":0},"/",{"$f":"SUM(IF(O20>N20,1,0),IF(Q20>P20,1,0),IF(S20>R20,1,0))","v":0},null,null,null,null,null,null,"",""]
[null,null,"BAR",1,14,{"$f":"F20+$B$4","v":"14:45:00"},1,{"$f":"AJ9","v":""},"/",{"$f":"AJ15","v":""},0,"/",0,null,null,null,null,null,null,"",""]
[null,null,"1/2",2,15,{"$f":"F21+$B$4","v":"15:30:00"},1,{"$f":"AJ8","v":""},"/",{"$f":"T20","v":""},0,"/",0,null,null,null,null,null,null,"",""]
[null,null,"1/2",2,16,{"$f":"F22+$B$4","v":"16:15:00"},1,{"$f":"AJ13","v":""},"/",{"$f":"T21","v":""},0,"/",0,null,null,null,null,null,null,"",""]
[null,null,"PF",2,17,"17:00:00",1,{"$f":"U22","v":""},"/",{"$f":"U23","v":""},0,"/",0,null,null,null,null,null,null,"",""]
[null,null,"F",2,18,"17:45:00",1,{"$f":"T22","v":""},"/",{"$f":"T23","v":""},0,"/",0,null,null,null,null,null,null,"",""]

{"sheet":"RELEVE","index":3,"n_rows":79,"n_cols":14,"rows_kept":79,"cut":false,"hidden":false,"merged":[[78,2,84,10],[14,4,14,6],[15,2,15,3],[15,4,15,6],[16,2,16,3],[16,4,16,6],[17,2,17,3],[17,4,17,6],[18,2,18,3],[18,4,18,6],[19,2,19,3],[19,4,19,6],[69,2,75,10],[9,8,9,9],[2,2,2,3],[2,4,2,10],[3,2,3,3],[3,4,3,5],[4,2,4,3],[4,4,4,5],[5,2,5,3],[5,4,5,5],[6,2,6,3],[6,4,6,5],[8,8,8,9]]}
[null,null,"RELEVE DES RESULTATS ET SANCTIONS - TOURNOI DE BEACH VOLLEY"]
[]
[null,null,"APPELATION DU TOURNOI",null,{"$f":"IF(EMARGEMENT!T3=\"\",\"\",EMARGEMENT!T3)","v":""}]
[null,null,"TYPE",null,{"$f":"IF(EMARGEMENT!T5=\"\",\"\",EMARGEMENT!T5)","v":""}]
[null,null,"GENRE",null,{"$f":"IF(EMARGEMENT!T9=\"\",\"\",EMARGEMENT!T9)","v":""}]
[null,null,"DATE",null,{"$f":"IF(EMARGEMENT!T7=\"\",\"\",CONCATENATE(EMARGEMENT!T7,\"-\",EMARGEMENT!T8,\"/\",EMARGEMENT!T6))","v":""}]
[null,null,"ORGANISATEUR",null,{"$f":"IF(EMARGEMENT!T10=\"\",\"\",EMARGEMENT!T10)","v":""}]
[]
[null,null,"NOMBRE EQUIPE TABLEAU :",null,null,"PRINCIPAL",null,null,"QUALIFICATION"]
[null,null,"NOMBRE EQUIPE PRESENTES PAR TABLEAU",null,null,"PRINCIPAL",null,null,"QUALIFICATION"]
[]
[]
[null,null,"COMPOSITION DE LA COMMISSION DE DIRECTION"]
[]
[null,null,"DELEGUE INSTANCE FEDERAL"]
[null,null,"SUPERVISEUR"]
[null,null,"JUGE ARBITRE"]
[null,null,"ORGANISATEUR"]
[null,null,"REPRESENTANT JOUEURS"]
[null,null,"RAPPORTEUR*"]
[]
[]
[]
[]
[]
[null,null,"EQUIPES ABSENTES"]
[null,null,"NOM","PRENOM","LIC J1","club J1","NOM2","PRENOM3","LIC J2","club J2"]
[]
[]
[]
[]
[]
[]
[null,null,"RECLAMATIONS"]
[null,null,"NOM","PRENOM","LIC J1","club J1","NOM2","PRENOM3","LIC J2","club J2","RANG","NIVEAU","MOTIF ","AVIS COMMISSION"]
[null,1]
[null,2]
[null,3]
[null,4]
[null,5]
[null,6]
[]
[null,null,"EQUIPES/JOUEURS SANCTIONNES"]
[null,null,"NOM","PRENOM","LIC J1","club J1","NOM2","PRENOM3","LIC J2","club J2","RANG","SANCTION","MOTIF ","AVIS COMMISSION"]
[null,1]
[null,2]
[null,3]
[null,4]
[null,5]
[null,6]
[]
[null,null,"CLASSEMENT FINAL"]
[null,null,"NOM","PRENOM","LIC J1","club J1","NOM2","PRENOM3","LIC J2","club J2","RANG"]
[null,null,{"$f":"IF(EMARGEMENT!C10=\"\",\"\",EMARGEMENT!C10)","v":"T"},{"$f":"IF(EMARGEMENT!D10=\"\",\"\",EMARGEMENT!D10)","v":""},{"$f":"IF(EMARGEMENT!E10=\"\",\"\",EMARGEMENT!E10)","v":""},{"$f":"IF(EMARGEMENT!F10=\"\",\"\",EMARGEMENT!F10)","v":""},{"$f":"IF(EMARGEMENT!G10=\"\",\"\",EMARGEMENT!G10)","v":1},{"$f":"IF(EMARGEMENT!H10=\"\",\"\",EMARGEMENT!H10)","v":""},{"$f":"IF(EMARGEMENT!I10=\"\",\"\",EMARGEMENT!I10)","v":""},{"$f":"IF(EMARGEMENT!J10=\"\",\"\",EMARGEMENT!J10)","v":""}]
[null,null,{"$f":"IF(EMARGEMENT!C11=\"\",\"\",EMARGEMENT!C11)","v":"T"},{"$f":"IF(EMARGEMENT!D11=\"\",\"\",EMARGEMENT!D11)","v":""},{"$f":"IF(EMARGEMENT!E11=\"\",\"\",EMARGEMENT!E11)","v":""},{"$f":"IF(EMARGEMENT!F11=\"\",\"\",EMARGEMENT!F11)","v":""},{"$f":"IF(EMARGEMENT!G11=\"\",\"\",EMARGEMENT!G11)","v":2},{"$f":"IF(EMARGEMENT!H11=\"\",\"\",EMARGEMENT!H11)","v":""},{"$f":"IF(EMARGEMENT!I11=\"\",\"\",EMARGEMENT!I11)","v":""},{"$f":"IF(EMARGEMENT!J11=\"\",\"\",EMARGEMENT!J11)","v":""}]
[null,null,{"$f":"IF(EMARGEMENT!C12=\"\",\"\",EMARGEMENT!C12)","v":"T"},{"$f":"IF(EMARGEMENT!D12=\"\",\"\",EMARGEMENT!D12)","v":""},{"$f":"IF(EMARGEMENT!E12=\"\",\"\",EMARGEMENT!E12)","v":""},{"$f":"IF(EMARGEMENT!F12=\"\",\"\",EMARGEMENT!F12)","v":""},{"$f":"IF(EMARGEMENT!G12=\"\",\"\",EMARGEMENT!G12)","v":3},{"$f":"IF(EMARGEMENT!H12=\"\",\"\",EMARGEMENT!H12)","v":""},{"$f":"IF(EMARGEMENT!I12=\"\",\"\",EMARGEMENT!I12)","v":""},{"$f":"IF(EMARGEMENT!J12=\"\",\"\",EMARGEMENT!J12)","v":""}]
[null,null,{"$f":"IF(EMARGEMENT!C13=\"\",\"\",EMARGEMENT!C13)","v":"T"},{"$f":"IF(EMARGEMENT!D13=\"\",\"\",EMARGEMENT!D13)","v":""},{"$f":"IF(EMARGEMENT!E13=\"\",\"\",EMARGEMENT!E13)","v":""},{"$f":"IF(EMARGEMENT!F13=\"\",\"\",EMARGEMENT!F13)","v":""},{"$f":"IF(EMARGEMENT!G13=\"\",\"\",EMARGEMENT!G13)","v":4},{"$f":"IF(EMARGEMENT!H13=\"\",\"\",EMARGEMENT!H13)","v":""},{"$f":"IF(EMARGEMENT!I13=\"\",\"\",EMARGEMENT!I13)","v":""},{"$f":"IF(EMARGEMENT!J13=\"\",\"\",EMARGEMENT!J13)","v":""}]
[null,null,{"$f":"IF(EMARGEMENT!C14=\"\",\"\",EMARGEMENT!C14)","v":"T"},{"$f":"IF(EMARGEMENT!D14=\"\",\"\",EMARGEMENT!D14)","v":""},{"$f":"IF(EMARGEMENT!E14=\"\",\"\",EMARGEMENT!E14)","v":""},{"$f":"IF(EMARGEMENT!F14=\"\",\"\",EMARGEMENT!F14)","v":""},{"$f":"IF(EMARGEMENT!G14=\"\",\"\",EMARGEMENT!G14)","v":5},{"$f":"IF(EMARGEMENT!H14=\"\",\"\",EMARGEMENT!H14)","v":""},{"$f":"IF(EMARGEMENT!I14=\"\",\"\",EMARGEMENT!I14)","v":""},{"$f":"IF(EMARGEMENT!J14=\"\",\"\",EMARGEMENT!J14)","v":""}]
[null,null,{"$f":"IF(EMARGEMENT!C15=\"\",\"\",EMARGEMENT!C15)","v":"T"},{"$f":"IF(EMARGEMENT!D15=\"\",\"\",EMARGEMENT!D15)","v":""},{"$f":"IF(EMARGEMENT!E15=\"\",\"\",EMARGEMENT!E15)","v":""},{"$f":"IF(EMARGEMENT!F15=\"\",\"\",EMARGEMENT!F15)","v":""},{"$f":"IF(EMARGEMENT!G15=\"\",\"\",EMARGEMENT!G15)","v":6},{"$f":"IF(EMARGEMENT!H15=\"\",\"\",EMARGEMENT!H15)","v":""},{"$f":"IF(EMARGEMENT!I15=\"\",\"\",EMARGEMENT!I15)","v":""},{"$f":"IF(EMARGEMENT!J15=\"\",\"\",EMARGEMENT!J15)","v":""}]
[null,null,{"$f":"IF(EMARGEMENT!C16=\"\",\"\",EMARGEMENT!C16)","v":"T"},{"$f":"IF(EMARGEMENT!D16=\"\",\"\",EMARGEMENT!D16)","v":""},{"$f":"IF(EMARGEMENT!E16=\"\",\"\",EMARGEMENT!E16)","v":""},{"$f":"IF(EMARGEMENT!F16=\"\",\"\",EMARGEMENT!F16)","v":""},{"$f":"IF(EMARGEMENT!G16=\"\",\"\",EMARGEMENT!G16)","v":7},{"$f":"IF(EMARGEMENT!H16=\"\",\"\",EMARGEMENT!H16)","v":""},{"$f":"IF(EMARGEMENT!I16=\"\",\"\",EMARGEMENT!I16)","v":""},{"$f":"IF(EMARGEMENT!J16=\"\",\"\",EMARGEMENT!J16)","v":""}]
[null,null,{"$f":"IF(EMARGEMENT!C17=\"\",\"\",EMARGEMENT!C17)","v":"T"},{"$f":"IF(EMARGEMENT!D17=\"\",\"\",EMARGEMENT!D17)","v":""},{"$f":"IF(EMARGEMENT!E17=\"\",\"\",EMARGEMENT!E17)","v":""},{"$f":"IF(EMARGEMENT!F17=\"\",\"\",EMARGEMENT!F17)","v":""},{"$f":"IF(EMARGEMENT!G17=\"\",\"\",EMARGEMENT!G17)","v":8},{"$f":"IF(EMARGEMENT!H17=\"\",\"\",EMARGEMENT!H17)","v":""},{"$f":"IF(EMARGEMENT!I17=\"\",\"\",EMARGEMENT!I17)","v":""},{"$f":"IF(EMARGEMENT!J17=\"\",\"\",EMARGEMENT!J17)","v":""}]
[null,null,{"$f":"IF(EMARGEMENT!C18=\"\",\"\",EMARGEMENT!C18)","v":""},{"$f":"IF(EMARGEMENT!D18=\"\",\"\",EMARGEMENT!D18)","v":""},{"$f":"IF(EMARGEMENT!E18=\"\",\"\",EMARGEMENT!E18)","v":""},{"$f":"IF(EMARGEMENT!F18=\"\",\"\",EMARGEMENT!F18)","v":""},{"$f":"IF(EMARGEMENT!G18=\"\",\"\",EMARGEMENT!G18)","v":""},{"$f":"IF(EMARGEMENT!H18=\"\",\"\",EMARGEMENT!H18)","v":""},{"$f":"IF(EMARGEMENT!I18=\"\",\"\",EMARGEMENT!I18)","v":""},{"$f":"IF(EMARGEMENT!J18=\"\",\"\",EMARGEMENT!J18)","v":""}]
[null,null,{"$f":"IF(EMARGEMENT!C19=\"\",\"\",EMARGEMENT!C19)","v":""},{"$f":"IF(EMARGEMENT!D19=\"\",\"\",EMARGEMENT!D19)","v":""},{"$f":"IF(EMARGEMENT!E19=\"\",\"\",EMARGEMENT!E19)","v":""},{"$f":"IF(EMARGEMENT!F19=\"\",\"\",EMARGEMENT!F19)","v":""},{"$f":"IF(EMARGEMENT!G19=\"\",\"\",EMARGEMENT!G19)","v":""},{"$f":"IF(EMARGEMENT!H19=\"\",\"\",EMARGEMENT!H19)","v":""},{"$f":"IF(EMARGEMENT!I19=\"\",\"\",EMARGEMENT!I19)","v":""},{"$f":"IF(EMARGEMENT!J19=\"\",\"\",EMARGEMENT!J19)","v":""}]
[null,null,{"$f":"IF(EMARGEMENT!C20=\"\",\"\",EMARGEMENT!C20)","v":""},{"$f":"IF(EMARGEMENT!D20=\"\",\"\",EMARGEMENT!D20)","v":""},{"$f":"IF(EMARGEMENT!E20=\"\",\"\",EMARGEMENT!E20)","v":""},{"$f":"IF(EMARGEMENT!F20=\"\",\"\",EMARGEMENT!F20)","v":""},{"$f":"IF(EMARGEMENT!G20=\"\",\"\",EMARGEMENT!G20)","v":""},{"$f":"IF(EMARGEMENT!H20=\"\",\"\",EMARGEMENT!H20)","v":""},{"$f":"IF(EMARGEMENT!I20=\"\",\"\",EMARGEMENT!I20)","v":""},{"$f":"IF(EMARGEMENT!J20=\"\",\"\",EMARGEMENT!J20)","v":""}]
[null,null,{"$f":"IF(EMARGEMENT!C21=\"\",\"\",EMARGEMENT!C21)","v":""},{"$f":"IF(EMARGEMENT!D21=\"\",\"\",EMARGEMENT!D21)","v":""},{"$f":"IF(EMARGEMENT!E21=\"\",\"\",EMARGEMENT!E21)","v":""},{"$f":"IF(EMARGEMENT!F21=\"\",\"\",EMARGEMENT!F21)","v":""},{"$f":"IF(EMARGEMENT!G21=\"\",\"\",EMARGEMENT!G21)","v":""},{"$f":"IF(EMARGEMENT!H21=\"\",\"\",EMARGEMENT!H21)","v":""},{"$f":"IF(EMARGEMENT!I21=\"\",\"\",EMARGEMENT!I21)","v":""},{"$f":"IF(EMARGEMENT!J21=\"\",\"\",EMARGEMENT!J21)","v":""}]
[null,null,{"$f":"IF(EMARGEMENT!C22=\"\",\"\",EMARGEMENT!C22)","v":""},{"$f":"IF(EMARGEMENT!D22=\"\",\"\",EMARGEMENT!D22)","v":""},{"$f":"IF(EMARGEMENT!E22=\"\",\"\",EMARGEMENT!E22)","v":""},{"$f":"IF(EMARGEMENT!F22=\"\",\"\",EMARGEMENT!F22)","v":""},{"$f":"IF(EMARGEMENT!G22=\"\",\"\",EMARGEMENT!G22)","v":""},{"$f":"IF(EMARGEMENT!H22=\"\",\"\",EMARGEMENT!H22)","v":""},{"$f":"IF(EMARGEMENT!I22=\"\",\"\",EMARGEMENT!I22)","v":""},{"$f":"IF(EMARGEMENT!J22=\"\",\"\",EMARGEMENT!J22)","v":""}]
[null,null,{"$f":"IF(EMARGEMENT!C23=\"\",\"\",EMARGEMENT!C23)","v":""},{"$f":"IF(EMARGEMENT!D23=\"\",\"\",EMARGEMENT!D23)","v":""},{"$f":"IF(EMARGEMENT!E23=\"\",\"\",EMARGEMENT!E23)","v":""},{"$f":"IF(EMARGEMENT!F23=\"\",\"\",EMARGEMENT!F23)","v":""},{"$f":"IF(EMARGEMENT!G23=\"\",\"\",EMARGEMENT!G23)","v":""},{"$f":"IF(EMARGEMENT!H23=\"\",\"\",EMARGEMENT!H23)","v":""},{"$f":"IF(EMARGEMENT!I23=\"\",\"\",EMARGEMENT!I23)","v":""},{"$f":"IF(EMARGEMENT!J23=\"\",\"\",EMARGEMENT!J23)","v":""}]
[]
[]
[null,null,"REMARQUES :"]
[]
[]
[]
[]
[]
[]
[]
[]
[null,null,"SIGNATURES :"]

{"sheet":"LISTE","index":4,"n_rows":15,"n_cols":9,"rows_kept":15,"cut":false,"hidden":true,"merged":[]}
[]
[]
[]
[]
[null,null,null,"MASCULIN","FEMININ","MIXTE",null,null,"ABS"]
[null,null,null,"SERIE 1 -2500","SERIE 1 -2500","SERIE 3 - 150",2020,null,1]
[null,null,null,"SERIE 1 -2000","SERIE 1 -2000","SERIE 3 ",2021,null,2]
[null,null,null,"SERIE 1 - 1500","SERIE 1 - 1500","TYPE",2022,null,3]
[null,null,null,"SERIE 2 - 1000","SERIE 2 - 1000",null,2023,null,4]
[null,null,null,"SERIE 2 - 750","SERIE 2 - 750",null,2024,null,5]
[null,null,null,"SERIE 2 - 500","SERIE 2 - 500",null,null,null,6]
[null,null,null,"SERIE 2 - 250","SERIE 2 - 250",null,null,null,7]
[null,null,null,"SERIE 3 - 150","SERIE 3 - 150",null,null,null,8]
[null,null,null,"SERIE 3 ","SERIE 3 "]
[null,null,null,"TYPE","TYPE"]